{"text_format":"1","workbook":"xlsx","n_sheets":2,"sheets":["Results","Data"],"not_rendered":{"charts":0,"images":0,"macros":1,"external_links":0,"defined_names":0,"comments":0,"pivot_tables":0},"unopened":[],"bounds":{"document_bytes":16777216,"sheet_cells":100000,"rows_first":2000,"rows_last":500,"rows_between":2000,"halvings":0,"cell_chars":16384,"cell_head_chars":4096},"cells_cut":0,"cells_raw":0,"read":"whole","date_system":"1900"}

{"sheet":"Results","index":0,"n_rows":3,"n_cols":7,"rows_kept":3,"cut":false,"hidden":false,"merged":[]}
[]
[null,"Employee NO","Employee Name","Date of Birth","Date of Joining","Department","Designation"]
[null,42,{"$f":"IFERROR(VLOOKUP($B$3,Data!$A:$F,2,0),\"\")","v":"pankaj tripathi"},{"$f":"IFERROR(VLOOKUP($B$3,Data!$A:$F,3,0),\"\")","v":"1992-01-09"},{"$f":"IFERROR(VLOOKUP($B$3,Data!$A:$F,4,0),\"\")","v":"2018-04-09"},{"$f":"IFERROR(VLOOKUP($B$3,Data!$A:$F,5,0),\"\")","v":"Accounts"},{"$f":"IFERROR(VLOOKUP($B$3,Data!$A:$F,6,0),\"\")","v":"Trainee"}]

{"sheet":"Data","index":1,"n_rows":51,"n_cols":6,"rows_kept":51,"cut":false,"hidden":false,"merged":[]}
["Employee NO","Employee Name","Date of Birth","Date of Joining","Department","Designation"]
[50,"Mitesh Shah","1992-01-01","2018-04-01","Accounts","Associate"]
[49,"Mahendra Nikam","1992-01-02","2018-04-02","Accounts","Manager"]
[48,"aakash srivastava","1992-01-03","2018-04-03","Accounts","Trainee"]
[47,"Tainesh Patil","1992-01-04","2018-04-04","Accounts","Associate"]
[46,"geeta","1992-01-05","2018-04-05","Accounts","Manager"]
[45,"Rohit Singh","1992-01-06","2018-04-06","Accounts","Trainee"]
[44,"Sriram","1992-01-07","2018-04-07","Accounts","Associate"]
[43,"Megha Rani","1992-01-08","2018-04-08","Accounts","Manager"]
[42,"pankaj tripathi","1992-01-09","2018-04-09","Accounts","Trainee"]
[41,"Preetham","1992-01-10","2018-04-10","Accounts","Associate"]
[40,"Jenifer","1992-01-11","2018-04-11","Accounts","Manager"]
[39,"sweta jha","1992-01-12","2018-04-12","Accounts","Trainee"]
[38,"Gurmeet Singh","1992-01-13","2018-04-13","Accounts","Associate"]
[37,"Trilochan Mohanty","1992-01-14","2018-04-14","HRM","Manager"]
[36,"SYED RAZA IMAM","1992-01-15","2018-04-15","HRM","Trainee"]
[35,"Naveen Singh","1992-01-16","2018-04-16","HRM","Associate"]
[34,"ravi kumar","1992-01-17","2018-04-17","HRM","Manager"]
[33,"Raunak kumar","1992-01-18","2018-04-18","HRM","Trainee"]
[32,"priyanka kumari rai","1992-01-19","2018-04-19","HRM","Associate"]
[31,"Anupam Ashok Bahutmage","1992-01-20","2018-04-20","HRM","Manager"]
[30,"Raghabendra prasad","1992-01-21","2018-04-21","HRM","Trainee"]
[29,"Silpa Suman Nayak","1992-01-22","2018-04-22","HRM","Associate"]
[28,"Riddhi Modi","1992-01-23","2018-04-23","HRM","Manager"]
[27,"SAYED SOYEB ALI","1992-01-24","2018-04-24","HRM","Trainee"]
[26,"ANANDA K","1992-01-25","2018-04-25","HRM","Associate"]
[25,"Pawan kumar gupta","1992-01-26","2018-04-26","HRM","Manager"]
[24,"Tamanna Keen","1992-01-27","2018-04-27","HRM","Trainee"]
[23,"Mrinal Banerji","1992-01-28","2018-04-28","HRM","Associate"]
[22,"Rachana Abhilash","1992-01-29","2018-04-29","Admin","Manager"]
[21,"aprajita saxena","1992-01-30","2018-04-30","Admin","Trainee"]
[20,"RITU","1992-01-31","2018-05-01","Admin","Associate"]
[19,"Arindam Chakraborty","1992-02-01","2018-05-02","Admin","Manager"]
[18,"Nihal Kothare","1992-02-02","2018-05-03","Admin","Trainee"]
[17,"Sneha Ranjan","1992-02-03","2018-05-04","Admin","Associate"]
[16,"Pramuda","1992-02-04","2018-05-05","Admin","Manager"]
[15,"Johnson","1992-02-05","2018-05-06","Admin","Trainee"]
[14,"Pankaj Srivastava","1992-02-06","2018-05-07","Admin","Associate"]
[13,"MD MUNAWWAR HUSSAIN KHAN","1992-02-07","2018-05-08","Admin","Manager"]
[12,"NISHA","1992-02-08","2018-05-09","Admin","Trainee"]
[11,"rajnish kumar jha","1992-02-09","2018-05-10","Admin","Associate"]
[10,"Naveen Singh Negi","1992-02-10","2018-05-11","Admin","Manager"]
[9,"Jacqueline Margaret Gangera","1992-02-11","2018-05-12","Admin","Trainee"]
[8,"ameerjan","1992-02-12","2018-05-13","Admin","Associate"]
[7,"Sowmya Safeena","1992-02-13","2018-05-14","IT","Manager"]
[6,"Shirish Deshpande","1992-02-14","2018-05-15","IT","Trainee"]
[5,"NASEEM AHMAD KHAN","1992-02-15","2018-05-16","IT","Associate"]
[4,"megha","1992-02-16","2018-05-17","IT","Manager"]
[3,"chandan vikram singh","1992-02-17","2018-05-18","IT","Trainee"]
[2,"RAHUL SHRIRAM ISTE","1992-02-18","2018-05-19","IT","Associate"]
[1,"Deep Singh","1992-02-19","2018-05-20","IT","Manager"]