{"text_format":"1","workbook":"xlsx","n_sheets":5,"sheets":["Company Master","Data Sheet for 12BA","Data Sheet for Part B","Form 16 part B","Form 12BA"],"not_rendered":{"charts":0,"images":2,"macros":1,"external_links":1,"defined_names":54,"comments":0,"pivot_tables":0},"unopened":[],"bounds":{"document_bytes":16777216,"sheet_cells":100000,"rows_first":2000,"rows_last":500,"rows_between":2000,"halvings":0,"cell_chars":16384,"cell_head_chars":4096},"cells_cut":0,"cells_raw":0,"read":"whole","date_system":"1900"}

{"sheet":"Company Master","index":0,"n_rows":21,"n_cols":3,"rows_kept":21,"cut":false,"hidden":false,"merged":[[1,0,1,2],[5,1,5,2],[15,1,15,2]]}
[]
["Form 16 part B and Form 12BA Printing Utility."]
[]
[]
[]
[null,"Employer Details"]
[null," Name of the employeer:","Excelhub.org"]
[null,"Address of employer:","No. 1, New address"]
[null,null,"New road,"]
[null,null,"New town- 560001"]
[null,"TDS Assessment Range of the employer:","BLR, 17 D"]
[null,"TAN:","BBBBB1234G"]
[null,"Financial Year:","2016-17"]
[null,"Assessment Year:","2017-18"]
[]
[null,"Signatory Details"]
[null,"Name:","My Name"]
[null,"Father Name:","Father Name"]
[null,"Designation:","Director"]
[null,"Place:","Bangalore"]
[null,"Date:","2017-05-30"]

{"sheet":"Data Sheet for 12BA","index":1,"n_rows":503,"n_cols":24,"rows_kept":503,"cut":false,"hidden":true,"merged":[[1,23,2,23],[1,12,2,12],[1,13,2,13],[1,14,2,14],[1,15,2,15],[1,16,2,16],[1,17,2,17],[1,18,2,18],[1,19,2,19],[1,20,2,20],[1,21,2,21],[1,22,2,22],[1,11,2,11],[1,0,2,0],[1,1,2,1],[1,2,2,2],[1,3,2,3],[1,4,2,4],[1,5,2,5],[1,6,2,6],[1,7,2,7],[1,8,2,8],[1,9,2,9],[1,10,2,10]]}
["Details for Form 12BA"]
["SL No:","Emp No.","Name","PAN","Income under the head “Salaries”","Accommodation","Cars/Other automotive","Sweeper, gardener, watchman or personal attendant","Gas, electricity, water","Interest free or concessional loans","Holiday expenses","Free or concessional travel","Free meals","Free education","Gifts, vouchers, etc.","Credit card expenses","Club expenses","Use of movable assets by employees","Transfer of assets to employees","Value of any other benefit / amenity / service / privilege","Stock options ( non-qualified options)","Other benefits or amenities","Total value of perquisites","Total value of Profits in lieu of salary as per section 17(3)"]
[]
[1,{"$f":"IF('Data Sheet for Part B'!B487=\"\",\"\",'Data Sheet for Part B'!B487)","v":""},{"$f":"IF('Data Sheet for Part B'!C487=\"\",\"\",'Data Sheet for Part B'!C487)","v":""},{"$f":"IF('Data Sheet for Part B'!D487=\"\",\"\",'Data Sheet for Part B'!D487)","v":""}]
[2,{"$f":"IF('Data Sheet for Part B'!B488=\"\",\"\",'Data Sheet for Part B'!B488)","v":""},{"$f":"IF('Data Sheet for Part B'!C488=\"\",\"\",'Data Sheet for Part B'!C488)","v":""},{"$f":"IF('Data Sheet for Part B'!D488=\"\",\"\",'Data Sheet for Part B'!D488)","v":""}]
[3,{"$f":"IF('Data Sheet for Part B'!B489=\"\",\"\",'Data Sheet for Part B'!B489)","v":""},{"$f":"IF('Data Sheet for Part B'!C489=\"\",\"\",'Data Sheet for Part B'!C489)","v":""},{"$f":"IF('Data Sheet for Part B'!D489=\"\",\"\",'Data Sheet for Part B'!D489)","v":""}]
[4,{"$f":"IF('Data Sheet for Part B'!B490=\"\",\"\",'Data Sheet for Part B'!B490)","v":""},{"$f":"IF('Data Sheet for Part B'!C490=\"\",\"\",'Data Sheet for Part B'!C490)","v":""},{"$f":"IF('Data Sheet for Part B'!D490=\"\",\"\",'Data Sheet for Part B'!D490)","v":""}]
[5,{"$f":"IF('Data Sheet for Part B'!B491=\"\",\"\",'Data Sheet for Part B'!B491)","v":""},{"$f":"IF('Data Sheet for Part B'!C491=\"\",\"\",'Data Sheet for Part B'!C491)","v":""},{"$f":"IF('Data Sheet for Part B'!D491=\"\",\"\",'Data Sheet for Part B'!D491)","v":""}]
[6,{"$f":"IF('Data Sheet for Part B'!B492=\"\",\"\",'Data Sheet for Part B'!B492)","v":""},{"$f":"IF('Data Sheet for Part B'!C492=\"\",\"\",'Data Sheet for Part B'!C492)","v":""},{"$f":"IF('Data Sheet for Part B'!D492=\"\",\"\",'Data Sheet for Part B'!D492)","v":""}]
[7,{"$f":"IF('Data Sheet for Part B'!B493=\"\",\"\",'Data Sheet for Part B'!B493)","v":""},{"$f":"IF('Data Sheet for Part B'!C493=\"\",\"\",'Data Sheet for Part B'!C493)","v":""},{"$f":"IF('Data Sheet for Part B'!D493=\"\",\"\",'Data Sheet for Part B'!D493)","v":""}]
[8,{"$f":"IF('Data Sheet for Part B'!B494=\"\",\"\",'Data Sheet for Part B'!B494)","v":""},{"$f":"IF('Data Sheet for Part B'!C494=\"\",\"\",'Data Sheet for Part B'!C494)","v":""},{"$f":"IF('Data Sheet for Part B'!D494=\"\",\"\",'Data Sheet for Part B'!D494)","v":""}]
[9,{"$f":"IF('Data Sheet for Part B'!B495=\"\",\"\",'Data Sheet for Part B'!B495)","v":""},{"$f":"IF('Data Sheet for Part B'!C495=\"\",\"\",'Data Sheet for Part B'!C495)","v":""},{"$f":"IF('Data Sheet for Part B'!D495=\"\",\"\",'Data Sheet for Part B'!D495)","v":""}]
[10,{"$f":"IF('Data Sheet for Part B'!B496=\"\",\"\",'Data Sheet for Part B'!B496)","v":""},{"$f":"IF('Data Sheet for Part B'!C496=\"\",\"\",'Data Sheet for Part B'!C496)","v":""},{"$f":"IF('Data Sheet for Part B'!D496=\"\",\"\",'Data Sheet for Part B'!D496)","v":""}]
[11,{"$f":"IF('Data Sheet for Part B'!B497=\"\",\"\",'Data Sheet for Part B'!B497)","v":""},{"$f":"IF('Data Sheet for Part B'!C497=\"\",\"\",'Data Sheet for Part B'!C497)","v":""},{"$f":"IF('Data Sheet for Part B'!D497=\"\",\"\",'Data Sheet for Part B'!D497)","v":""}]
[12,{"$f":"IF('Data Sheet for Part B'!B498=\"\",\"\",'Data Sheet for Part B'!B498)","v":""},{"$f":"IF('Data Sheet for Part B'!C498=\"\",\"\",'Data Sheet for Part B'!C498)","v":""},{"$f":"IF('Data Sheet for Part B'!D498=\"\",\"\",'Data Sheet for Part B'!D498)","v":""}]
[13,{"$f":"IF('Data Sheet for Part B'!B499=\"\",\"\",'Data Sheet for Part B'!B499)","v":""},{"$f":"IF('Data Sheet for Part B'!C499=\"\",\"\",'Data Sheet for Part B'!C499)","v":""},{"$f":"IF('Data Sheet for Part B'!D499=\"\",\"\",'Data Sheet for Part B'!D499)","v":""}]
[14,{"$f":"IF('Data Sheet for Part B'!B500=\"\",\"\",'Data Sheet for Part B'!B500)","v":""},{"$f":"IF('Data Sheet for Part B'!C500=\"\",\"\",'Data Sheet for Part B'!C500)","v":""},{"$f":"IF('Data Sheet for Part B'!D500=\"\",\"\",'Data Sheet for Part B'!D500)","v":""}]
[15,{"$f":"IF('Data Sheet for Part B'!B501=\"\",\"\",'Data Sheet for Part B'!B501)","v":""},{"$f":"IF('Data Sheet for Part B'!C501=\"\",\"\",'Data Sheet for Part B'!C501)","v":""},{"$f":"IF('Data Sheet for Part B'!D501=\"\",\"\",'Data Sheet for Part B'!D501)","v":""}]
[16,{"$f":"IF('Data Sheet for Part B'!B502=\"\",\"\",'Data Sheet for Part B'!B502)","v":""},{"$f":"IF('Data Sheet for Part B'!C502=\"\",\"\",'Data Sheet for Part B'!C502)","v":""},{"$f":"IF('Data Sheet for Part B'!D502=\"\",\"\",'Data Sheet for Part B'!D502)","v":""}]
[17,{"$f":"IF('Data Sheet for Part B'!B503=\"\",\"\",'Data Sheet for Part B'!B503)","v":""},{"$f":"IF('Data Sheet for Part B'!C503=\"\",\"\",'Data Sheet for Part B'!C503)","v":""},{"$f":"IF('Data Sheet for Part B'!D503=\"\",\"\",'Data Sheet for Part B'!D503)","v":""}]
[18,{"$f":"IF('Data Sheet for Part B'!B504=\"\",\"\",'Data Sheet for Part B'!B504)","v":""},{"$f":"IF('Data Sheet for Part B'!C504=\"\",\"\",'Data Sheet for Part B'!C504)","v":""},{"$f":"IF('Data Sheet for Part B'!D504=\"\",\"\",'Data Sheet for Part B'!D504)","v":""}]
[19,{"$f":"IF('Data Sheet for Part B'!B505=\"\",\"\",'Data Sheet for Part B'!B505)","v":""},{"$f":"IF('Data Sheet for Part B'!C505=\"\",\"\",'Data Sheet for Part B'!C505)","v":""},{"$f":"IF('Data Sheet for Part B'!D505=\"\",\"\",'Data Sheet for Part B'!D505)","v":""}]
[20,{"$f":"IF('Data Sheet for Part B'!B506=\"\",\"\",'Data Sheet for Part B'!B506)","v":""},{"$f":"IF('Data Sheet for Part B'!C506=\"\",\"\",'Data Sheet for Part B'!C506)","v":""},{"$f":"IF('Data Sheet for Part B'!D506=\"\",\"\",'Data Sheet for Part B'!D506)","v":""}]
[21,{"$f":"IF('Data Sheet for Part B'!B507=\"\",\"\",'Data Sheet for Part B'!B507)","v":""},{"$f":"IF('Data Sheet for Part B'!C507=\"\",\"\",'Data Sheet for Part B'!C507)","v":""},{"$f":"IF('Data Sheet for Part B'!D507=\"\",\"\",'Data Sheet for Part B'!D507)","v":""}]
[22,{"$f":"IF('Data Sheet for Part B'!B508=\"\",\"\",'Data Sheet for Part B'!B508)","v":""},{"$f":"IF('Data Sheet for Part B'!C508=\"\",\"\",'Data Sheet for Part B'!C508)","v":""},{"$f":"IF('Data Sheet for Part B'!D508=\"\",\"\",'Data Sheet for Part B'!D508)","v":""}]
[23,{"$f":"IF('Data Sheet for Part B'!B509=\"\",\"\",'Data Sheet for Part B'!B509)","v":""},{"$f":"IF('Data Sheet for Part B'!C509=\"\",\"\",'Data Sheet for Part B'!C509)","v":""},{"$f":"IF('Data Sheet for Part B'!D509=\"\",\"\",'Data Sheet for Part B'!D509)","v":""}]
[24,{"$f":"IF('Data Sheet for Part B'!B510=\"\",\"\",'Data Sheet for Part B'!B510)","v":""},{"$f":"IF('Data Sheet for Part B'!C510=\"\",\"\",'Data Sheet for Part B'!C510)","v":""},{"$f":"IF('Data Sheet for Part B'!D510=\"\",\"\",'Data Sheet for Part B'!D510)","v":""}]
[25,{"$f":"IF('Data Sheet for Part B'!B511=\"\",\"\",'Data Sheet for Part B'!B511)","v":""},{"$f":"IF('Data Sheet for Part B'!C511=\"\",\"\",'Data Sheet for Part B'!C511)","v":""},{"$f":"IF('Data Sheet for Part B'!D511=\"\",\"\",'Data Sheet for Part B'!D511)","v":""}]
[26,{"$f":"IF('Data Sheet for Part B'!B512=\"\",\"\",'Data Sheet for Part B'!B512)","v":""},{"$f":"IF('Data Sheet for Part B'!C512=\"\",\"\",'Data Sheet for Part B'!C512)","v":""},{"$f":"IF('Data Sheet for Part B'!D512=\"\",\"\",'Data Sheet for Part B'!D512)","v":""}]
[27,{"$f":"IF('Data Sheet for Part B'!B513=\"\",\"\",'Data Sheet for Part B'!B513)","v":""},{"$f":"IF('Data Sheet for Part B'!C513=\"\",\"\",'Data Sheet for Part B'!C513)","v":""},{"$f":"IF('Data Sheet for Part B'!D513=\"\",\"\",'Data Sheet for Part B'!D513)","v":""}]
{"$rows_left_out":474}
{"sheet":"Data Sheet for Part B","index":2,"n_rows":503,"n_cols":49,"rows_kept":503,"cut":false,"hidden":false,"merged":[[1,3,2,3],[1,2,2,2],[1,1,2,1],[1,0,2,0],[1,43,2,43],[1,37,2,37],[1,38,2,38],[1,39,2,39],[1,40,2,40],[1,41,2,41],[1,42,2,42],[1,20,1,23],[1,28,1,35],[1,26,1,27],[1,24,2,24],[1,25,2,25],[1,44,2,44],[1,45,2,45],[1,46,2,46],[1,47,2,47],[1,48,2,48],[1,36,2,36],[1,4,1,7],[1,8,1,14],[1,16,1,17],[1,15,2,15],[1,18,2,18],[1,19,2,19]]}
["Details for Form 16 Part B"]
["SL No:","Emp No.","Name","PAN","1.  Gross Salary",null,null,null,"2. Less: Allowance to the extent exempt U/s 10",null,null,null,null,null,null,"3. Balance (1-2)","4. Deductions :",null,"5. Aggregate of 4(a) and (b)","6. Income chargebale under the head 'Salaries' (3-5)","7. Add: Any other income reported by the employee",null,null,null,"8. Gross Total income (6+7)","9. Deductions under Chapter VI A ","     (A) sections 80C, 80CCC and 80CCD",null,"    (B) other sections under Chapter VI-A",null,null,null,null,null,null,null,"10. Aggregate of deductible amount under Chapter VI A","11. Total Income (8-10)","12. Tax on total income","13. Rebate U/S 87A","14. Tax Payable after rebate","15. Education cess @ 3% ","16. Tax Payable ","17. Less: Relief under section 89 (attach details)","18. Tax Payable (15-16)","Tax deducted at current employeement","Tax deducted by others","Total tax deducted","Net tax payable /(Refundable)"]
[null,null,null,null,"(a) Salary as per provisions contained in sec. 17(1)","(b) Value of perquisites u/s 17(2)","(c) Profits in lieu of salary under section 17(3)","(d) Total","a) Conveyance Allowance","b) HRA Exemption","c) Children Education","d) Children Hostel","e) Medical Reimbursement","f) Leave travel allowance","g) Total",null,"     (a) Entertainment allowance","     (b) Tax on employment",null,null,"a) Income from Previous Employeement","b) Income from House Property","c) Income from Other Sources","d)Total",null,null,"i) PF Contribution (80C)","ii) Other Deductions under 80C, 80CCC& 80CCD","80CCD (1b) (Contribution to NPS)","80CCG (RGESS)","80D (Medical Insurance)","80DD (Rehabilitation of Handicapped Dependent)","80DDB (Medical Expenditure on Self or Dependent)","80E (Interest on Loan for Higher Studies)","80TTA (Interest on Savings account)","80U (Physical Disability)"]
[1,2225,"Mr. A","asdafq5345",1233440,1212,111,{"$f":"SUM(E4:G4)","v":1234763},11,22,33,44,55,66,{"$f":"SUM(I4:N4)","v":231},{"$f":"H4-O4","v":1234532},20,30,{"$f":"SUM(Q4:R4)","v":50},{"$f":"P4-S4","v":1234482},1111,22221,31313,{"$f":"SUM(U4:W4)","v":54645},{"$f":"T4+X4","v":1289127},null,1,2,3,4,5,6,7,8,9,10,{"$f":"SUM(AA4:AJ4)","v":55},{"$f":"Y4-AK4","v":1289072},{"$f":"IF(AL4>1000000,(125000+(AL4-1000000)*30%),IF(AL4>500000,(25000+(AL4-500000)*20%),IF(AL4>250000,((AL4-250000)*10%),0)))","v":211721.59999999998},{"$f":"IF(AL4<500001,(MIN(AM4,5000)),0)","v":0},{"$f":"+AM4-AN4","v":211721.59999999998},{"$f":"+AO4*3%","v":6351.6479999999992},{"$f":"+AO4+AP4","v":218073.24799999996},null,{"$f":"AQ4-AR4","v":218073.24799999996},null,null,{"$f":"SUM(AT4:AU4)","v":0},{"$f":"AS4-AV4","v":218073.24799999996}]
[2,null,null,null,null,null,null,{"$f":"SUM(E5:G5)","v":0},null,null,null,null,null,null,{"$f":"SUM(I5:N5)","v":0},{"$f":"H5-O5","v":0},null,null,{"$f":"SUM(Q5:R5)","v":0},{"$f":"P5-S5","v":0},null,null,null,{"$f":"SUM(U5:W5)","v":0},{"$f":"T5+X5","v":0},null,null,null,null,null,null,null,null,null,null,null,{"$f":"SUM(AA5:AJ5)","v":0},{"$f":"Y5-AK5","v":0},{"$f":"IF(AL5>1000000,(125000+(AL5-1000000)*30%),IF(AL5>500000,(25000+(AL5-500000)*20%),IF(AL5>250000,((AL5-250000)*10%),0)))","v":0},{"$f":"IF(AL5<500001,(MIN(AM5,5000)),0)","v":0},{"$f":"+AM5-AN5","v":0},{"$f":"+AO5*3%","v":0},{"$f":"+AO5+AP5","v":0},null,{"$f":"AQ5-AR5","v":0},null,null,{"$f":"SUM(AT5:AU5)","v":0},{"$f":"AS5-AV5","v":0}]
[3,null,null,null,null,null,null,0,null,null,null,null,null,null,0,0,null,null,0,0,null,null,null,0,0,null,null,null,null,null,null,null,null,null,null,null,0,0,0,0,0,0,0,null,0,null,null,0,0]
[4,null,null,null,null,null,null,0,null,null,null,null,null,null,0,0,null,null,0,0,null,null,null,0,0,null,null,null,null,null,null,null,null,null,null,null,0,0,0,0,0,0,0,null,0,null,null,0,0]
[5,null,null,null,null,null,null,0,null,null,null,null,null,null,0,0,null,null,0,0,null,null,null,0,0,null,null,null,null,null,null,null,null,null,null,null,0,0,0,0,0,0,0,null,0,null,null,0,0]
[6,null,null,null,null,null,null,0,null,null,null,null,null,null,0,0,null,null,0,0,null,null,null,0,0,null,null,null,null,null,null,null,null,null,null,null,0,0,0,0,0,0,0,null,0,null,null,0,0]
[7,null,null,null,null,null,null,0,null,null,null,null,null,null,0,0,null,null,0,0,null,null,null,0,0,null,null,null,null,null,null,null,null,null,null,null,0,0,0,0,0,0,0,null,0,null,null,0,0]
[8,null,null,null,null,null,null,0,null,null,null,null,null,null,0,0,null,null,0,0,null,null,null,0,0,null,null,null,null,null,null,null,null,null,null,null,0,0,0,0,0,0,0,null,0,null,null,0,0]
[9,null,null,null,null,null,null,0,null,null,null,null,null,null,0,0,null,null,0,0,null,null,null,0,0,null,null,null,null,null,null,null,null,null,null,null,0,0,0,0,0,0,0,null,0,null,null,0,0]
[10,null,null,null,null,null,null,0,null,null,null,null,null,null,0,0,null,null,0,0,null,null,null,0,0,null,null,null,null,null,null,null,null,null,null,null,0,0,0,0,0,0,0,null,0,null,null,0,0]
[11,null,null,null,null,null,null,0,null,null,null,null,null,null,0,0,null,null,0,0,null,null,null,0,0,null,null,null,null,null,null,null,null,null,null,null,0,0,0,0,0,0,0,null,0,null,null,0,0]
[12,null,null,null,null,null,null,0,null,null,null,null,null,null,0,0,null,null,0,0,null,null,null,0,0,null,null,null,null,null,null,null,null,null,null,null,0,0,0,0,0,0,0,null,0,null,null,0,0]
[13,null,null,null,null,null,null,0,null,null,null,null,null,null,0,0,null,null,0,0,null,null,null,0,0,null,null,null,null,null,null,null,null,null,null,null,0,0,0,0,0,0,0,null,0,null,null,0,0]
[14,null,null,null,null,null,null,0,null,null,null,null,null,null,0,0,null,null,0,0,null,null,null,0,0,null,null,null,null,null,null,null,null,null,null,null,0,0,0,0,0,0,0,null,0,null,null,0,0]
[15,null,null,null,null,null,null,0,null,null,null,null,null,null,0,0,null,null,0,0,null,null,null,0,0,null,null,null,null,null,null,null,null,null,null,null,0,0,0,0,0,0,0,null,0,null,null,0,0]
[16,null,null,null,null,null,null,0,null,null,null,null,null,null,0,0,null,null,0,0,null,null,null,0,0,null,null,null,null,null,null,null,null,null,null,null,0,0,0,0,0,0,0,null,0,null,null,0,0]
[17,null,null,null,null,null,null,0,null,null,null,null,null,null,0,0,null,null,0,0,null,null,null,0,0,null,null,null,null,null,null,null,null,null,null,null,0,0,0,0,0,0,0,null,0,null,null,0,0]
[18,null,null,null,null,null,null,0,null,null,null,null,null,null,0,0,null,null,0,0,null,null,null,0,0,null,null,null,null,null,null,null,null,null,null,null,0,0,0,0,0,0,0,null,0,null,null,0,0]
[19,null,null,null,null,null,null,0,null,null,null,null,null,null,0,0,null,null,0,0,null,null,null,0,0,null,null,null,null,null,null,null,null,null,null,null,0,0,0,0,0,0,0,null,0,null,null,0,0]
[20,null,null,null,null,null,null,0,null,null,null,null,null,null,0,0,null,null,0,0,null,null,null,0,0,null,null,null,null,null,null,null,null,null,null,null,0,0,0,0,0,0,0,null,0,null,null,0,0]
[21,null,null,null,null,null,null,0,null,null,null,null,null,null,0,0,null,null,0,0,null,null,null,0,0,null,null,null,null,null,null,null,null,null,null,null,0,0,0,0,0,0,0,null,0,null,null,0,0]
[22,null,null,null,null,null,null,0,null,null,null,null,null,null,0,0,null,null,0,0,null,null,null,0,0,null,null,null,null,null,null,null,null,null,null,null,0,0,0,0,0,0,0,null,0,null,null,0,0]
[23,null,null,null,null,null,null,0,null,null,null,null,null,null,0,0,null,null,0,0,null,null,null,0,0,null,null,null,null,null,null,null,null,null,null,null,0,0,0,0,0,0,0,null,0,null,null,0,0]
[24,null,null,null,null,null,null,0,null,null,null,null,null,null,0,0,null,null,0,0,null,null,null,0,0,null,null,null,null,null,null,null,null,null,null,null,0,0,0,0,0,0,0,null,0,null,null,0,0]
[25,null,null,null,null,null,null,0,null,null,null,null,null,null,0,0,null,null,0,0,null,null,null,0,0,null,null,null,null,null,null,null,null,null,null,null,0,0,0,0,0,0,0,null,0,null,null,0,0]
[26,null,null,null,null,null,null,0,null,null,null,null,null,null,0,0,null,null,0,0,null,null,null,0,0,null,null,null,null,null,null,null,null,null,null,null,0,0,0,0,0,0,0,null,0,null,null,0,0]
[27,null,null,null,null,null,null,0,null,null,null,null,null,null,0,0,null,null,0,0,null,null,null,0,0,null,null,null,null,null,null,null,null,null,null,null,0,0,0,0,0,0,0,null,0,null,null,0,0]
{"$rows_left_out":474}
{"sheet":"Form 16 part B","index":3,"n_rows":89,"n_cols":18,"rows_kept":89,"cut":false,"hidden":false,"merged":[[85,14,85,15],[86,14,86,15],[87,14,87,15],[88,14,88,15],[65,1,65,2],[65,3,65,5],[67,1,67,5],[83,7,83,13],[83,14,83,15],[84,14,84,15],[64,3,64,5],[6,1,6,5],[7,1,7,5],[9,1,9,2],[10,1,10,2],[11,1,11,2],[12,1,12,2],[13,1,13,2],[14,1,14,2],[58,1,58,5],[59,1,61,5],[62,3,63,5]]}
[]
[null,"Select Sl No.",1]
[null,"From:",1]
[null,"To:",2]
[]
[null,{"$f":"VLOOKUP($C$2,'Data Sheet for Part B'!$A:$AW,3,0)","v":"Mr. A"},{"$f":"VLOOKUP($C$2,'Data Sheet for Part B'!$A:$AW,2,0)","v":2225},{"$f":"VLOOKUP($C$2,'Data Sheet for Part B'!$A:$AW,4,0)","v":"asdafq5345"},null,{"$f":"\"AY \"&'Company Master'!C14","v":"AY 2017-18"}]
[null,"PART B (Annexure)"]
[null,"Details of Salary Paid and any other income and tax deducted"]
[null,null,null,"Rs.","Rs.","Rs."]
[null,"1.  Gross Salary"]
[null,"(a) Salary as per provisions contained in sec. 17(1)",null,{"$f":"VLOOKUP($C$2,'Data Sheet for Part B'!$A:$AW,H11,0)","v":1233440},null,null,null,5]
[null,"(b) Value of perquisites u/s 17(2)",null,{"$f":"VLOOKUP($C$2,'Data Sheet for Part B'!$A:$AW,H12,0)","v":1212},null,null,null,6]
[null,"(c) Profits in lieu of salary under section 17(3)",null,{"$f":"VLOOKUP($C$2,'Data Sheet for Part B'!$A:$AW,H13,0)","v":111},null,null,null,7]
[null,"(d) Total",null,null,{"$f":"SUM(D11:D13)","v":1234763}]
[]
[null,"2. Less: Allowance to the extent exempt U/s 10"]
[null,"a) Conveyance Allowance",null,{"$f":"VLOOKUP($C$2,'Data Sheet for Part B'!$A:$AW,H17,0)","v":11},null,null,null,9]
[null,"b) HRA Exemption",null,{"$f":"VLOOKUP($C$2,'Data Sheet for Part B'!$A:$AW,H18,0)","v":22},null,null,null,10]
[null,"c) Children Education",null,{"$f":"VLOOKUP($C$2,'Data Sheet for Part B'!$A:$AW,H19,0)","v":33},null,null,null,11]
[null,"d) Children Hostel",null,{"$f":"VLOOKUP($C$2,'Data Sheet for Part B'!$A:$AW,H20,0)","v":44},null,null,null,12]
[null,"e) Medical Reimbursement",null,{"$f":"VLOOKUP($C$2,'Data Sheet for Part B'!$A:$AW,H21,0)","v":55},null,null,null,13]
[null,"f) Leave travel allowance",null,{"$f":"VLOOKUP($C$2,'Data Sheet for Part B'!$A:$AW,H22,0)","v":66},null,null,null,14]
[null,"g) Total",null,null,{"$f":"SUM(D17:D22)","v":231}]
[null,"3. Balance (1-2)",null,null,{"$f":"+E14-E23","v":1234532}]
[null,"4. Deductions :"]
[null,"     (a) Entertainment allowance",null,{"$f":"VLOOKUP($C$2,'Data Sheet for Part B'!$A:$AW,H26,0)","v":20},null,null,null,17]
[null,"     (b) Tax on employment",null,{"$f":"VLOOKUP($C$2,'Data Sheet for Part B'!$A:$AW,H27,0)","v":30},null,null,null,18]
[null,"5. Aggregate of 4(a) and (b)",null,null,{"$f":"SUM(D26:D27)","v":50}]
[null,"6. Income chargebale under the head 'Salaries' (3-5)",null,null,null,{"$f":"+E24-E28","v":1234482}]
[null,"7. Add: Any other income reported by the employee"]
{"$rows_left_out":60}
{"sheet":"Form 12BA","index":4,"n_rows":70,"n_cols":26,"rows_kept":70,"cut":false,"hidden":false,"merged":[[67,0,68,2],[67,3,68,9],[67,10,68,24],[69,0,69,2],[69,3,69,9],[69,13,69,24],[55,0,55,1],[55,2,55,20],[55,21,55,24],[57,0,57,24],[59,0,62,24],[64,0,66,2],[64,3,66,9],[64,10,66,24],[53,0,53,1],[53,2,53,20],[53,21,53,24],[54,0,54,1],[54,2,54,20],[54,21,54,24],[51,0,51,1],[51,2,51,20],[51,21,51,24],[52,0,52,1],[52,2,52,20],[52,21,52,24],[49,0,49,1],[49,2,49,12],[49,13,49,16],[49,17,49,20],[49,21,49,24],[50,0,50,24],[47,0,47,1],[47,2,47,12],[47,13,47,16],[47,17,47,20],[47,21,47,24],[48,0,48,1],[48,2,48,12],[48,13,48,16],[48,17,48,20],[48,21,48,24],[45,0,45,1],[45,2,45,12],[45,13,45,16],[45,17,45,20],[45,21,45,24],[46,0,46,1],[46,2,46,12],[46,13,46,16],[46,17,46,20],[46,21,46,24],[43,0,43,1],[43,2,43,12],[43,13,43,16],[43,17,43,20],[43,21,43,24],[44,0,44,1],[44,2,44,12],[44,13,44,16],[44,17,44,20],[44,21,44,24],[41,0,41,1],[41,2,41,12],[41,13,41,16],[41,17,41,20],[41,21,41,24],[42,0,42,1],[42,2,42,12],[42,13,42,16],[42,17,42,20],[42,21,42,24],[39,0,39,1],[39,2,39,12],[39,13,39,16],[39,17,39,20],[39,21,39,24],[40,0,40,1],[40,2,40,12],[40,13,40,16],[40,17,40,20],[40,21,40,24],[37,0,37,1],[37,2,37,12],[37,13,37,16],[37,17,37,20],[37,21,37,24],[38,0,38,1],[38,2,38,12],[38,13,38,16],[38,17,38,20],[38,21,38,24],[35,0,35,1],[35,2,35,12],[35,13,35,16],[35,17,35,20],[35,21,35,24],[36,0,36,1],[36,2,36,12],[36,13,36,16],[36,17,36,20],[36,21,36,24],[33,0,33,1],[33,2,33,12],[33,13,33,16],[33,17,33,20],[33,21,33,24],[34,0,34,1],[34,2,34,12],[34,13,34,16],[34,17,34,20],[34,21,34,24],[31,0,31,1],[31,2,31,12],[31,13,31,16],[31,17,31,20],[31,21,31,24],[32,0,32,1],[32,2,32,12],[32,13,32,16],[32,17,32,20],[32,21,32,24],[28,2,28,12],[29,2,29,12],[30,2,30,12],[30,13,30,16],[30,17,30,20],[30,21,30,24],[24,1,24,10],[25,1,25,10],[26,1,26,24],[27,0,30,1],[27,2,27,12],[27,13,29,16],[27,17,29,20],[27,21,29,24],[25,11,25,24],[24,11,24,14],[22,1,22,10],[22,11,22,24],[23,1,23,10],[23,11,23,24],[18,1,18,10],[18,11,18,24],[19,1,19,10],[20,1,20,10],[20,11,20,24],[19,11,19,24],[15,1,15,10],[16,1,16,10],[17,1,17,10],[13,11,13,24],[14,11,14,24],[15,11,15,24],[16,11,16,24],[21,1,21,10],[21,11,21,24],[5,6,5,24],[8,0,8,24],[9,0,9,24],[10,0,10,24],[11,0,11,24],[12,0,12,10],[12,11,12,24],[13,1,13,10],[14,1,14,10]]}
[]
[null,"Select Sl. No.",null,null,null,1]
[]
[]
[]
["Original",null,null,null,24]
[]
[]
["FORM No. 12 BA"]
["[See rule 26A(2) (b)]"]
["Statement showing particulars of perquisites, other fringe benefits or"]
["amenities and profits in lieu of salary with value thereof"]
[]
[1," Name and address of employer:",null,null,null,null,null,null,null,null,null,{"$f":"'Company Master'!C7","v":"Excelhub.org"}]
[null,null,null,null,null,null,null,null,null,null,null,{"$f":"'Company Master'!C8","v":"No. 1, New address"}]
[null,null,null,null,null,null,null,null,null,null,null,{"$f":"'Company Master'!C9","v":"New road,"}]
[null,null,null,null,null,null,null,null,null,null,null,{"$f":"'Company Master'!C10","v":"New town- 560001"}]
[]
[2,"TAN:",null,null,null,null,null,null,null,null,null,{"$f":"'Company Master'!C12","v":"BBBBB1234G"}]
[3,"TDS Assessment Range of the employer:",null,null,null,null,null,null,null,null,null,{"$f":"'Company Master'!C11","v":"BLR, 17 D"}]
[4,"Name, designation and PAN of employee:",null,null,null,null,null,null,null,null,null,{"$f":"VLOOKUP($F$2,'Data Sheet for Part B'!$A:$O,3,0)&\" - \"&VLOOKUP($F$2,'Data Sheet for Part B'!$A:$O,4,0)","v":"Mr. A - asdafq5345"},null,null,null,null,null,null,null,null,null,null,null,null,null," , "]
[5,"Is the employee a director or a person with "]
[null,"substantial interest in the Company",null,null,null,null,null,null,null,null,null,"No"]
[6,"Income under the head “Salaries” of the "]
[null,"employee ( other than from perquisites):",null,null,null,null,null,null,null,null,null,{"$f":"VLOOKUP($F$2,'Data Sheet for Part B'!$A:$O,5,0)","v":1233440}]
[7,"Financial Year:",null,null,null,null,null,null,null,null,null,{"$f":"'Company Master'!C13","v":"2016-17"}]
[8,"Valuation of Perquisites:"]
["Sl. No.",null,"Nature of perquisite",null,null,null,null,null,null,null,null,null,null,"Value of perquisite as per rules",null,null,null," Amount, if any recovered from the employee",null,null,null,"Amount perquisite chargeable to tax Col.(3) – Col.(4)"]
[null,null," (See rule 3)"]
[]
{"$rows_left_out":40}