{"text_format":"1","workbook":"xlsx","n_sheets":6,"sheets":["Home","Form entry","Sheet1","Form 49A","DATABASE","Workings"],"not_rendered":{"charts":0,"images":65,"macros":1,"external_links":1,"defined_names":81,"comments":0,"pivot_tables":0},"unopened":[],"bounds":{"document_bytes":16777216,"sheet_cells":100000,"rows_first":2000,"rows_last":500,"rows_between":2000,"halvings":0,"cell_chars":16384,"cell_head_chars":4096},"cells_cut":0,"cells_raw":0,"read":"whole","date_system":"1900"}

{"sheet":"Home","index":0,"n_rows":504,"n_cols":7,"rows_kept":504,"cut":false,"hidden":false,"merged":[[0,4,0,5],[2,4,2,5]]}
[null,null,null,null,{"$f":"Workings!BK14","v":"Not Registered"}]
[]
[null,null,null,null,"Activation Code:"]
["Sl No","First Name","Middle Name","Last Name","Acknowledgment No.","PAN","Remark"]
[1,{"$f":"IFERROR((VLOOKUP($A5,DATABASE!$A:$BU,15,0)),\"\")","v":"XYX"},{"$f":"IFERROR((VLOOKUP($A5,DATABASE!$A:$BU,16,0)),\"\")","v":"ABC"},{"$f":"IFERROR((VLOOKUP($A5,DATABASE!$A:$BU,17,0)),\"\")","v":"HHH"},12345]
[2,{"$f":"IFERROR((VLOOKUP($A6,DATABASE!$A:$BU,15,0)),\"\")","v":"xyz"},{"$f":"IFERROR((VLOOKUP($A6,DATABASE!$A:$BU,16,0)),\"\")","v":"abc"},{"$f":"IFERROR((VLOOKUP($A6,DATABASE!$A:$BU,17,0)),\"\")","v":"pqr"}]
[3,{"$f":"IFERROR((VLOOKUP($A7,DATABASE!$A:$BU,15,0)),\"\")","v":0},{"$f":"IFERROR((VLOOKUP($A7,DATABASE!$A:$BU,16,0)),\"\")","v":0},{"$f":"IFERROR((VLOOKUP($A7,DATABASE!$A:$BU,17,0)),\"\")","v":0}]
[4,{"$f":"IFERROR((VLOOKUP($A8,DATABASE!$A:$BU,15,0)),\"\")","v":0},{"$f":"IFERROR((VLOOKUP($A8,DATABASE!$A:$BU,16,0)),\"\")","v":0},{"$f":"IFERROR((VLOOKUP($A8,DATABASE!$A:$BU,17,0)),\"\")","v":0}]
[5,{"$f":"IFERROR((VLOOKUP($A9,DATABASE!$A:$BU,15,0)),\"\")","v":0},{"$f":"IFERROR((VLOOKUP($A9,DATABASE!$A:$BU,16,0)),\"\")","v":0},{"$f":"IFERROR((VLOOKUP($A9,DATABASE!$A:$BU,17,0)),\"\")","v":0}]
[6,{"$f":"IFERROR((VLOOKUP($A10,DATABASE!$A:$BU,15,0)),\"\")","v":0},{"$f":"IFERROR((VLOOKUP($A10,DATABASE!$A:$BU,16,0)),\"\")","v":0},{"$f":"IFERROR((VLOOKUP($A10,DATABASE!$A:$BU,17,0)),\"\")","v":0}]
[7,{"$f":"IFERROR((VLOOKUP($A11,DATABASE!$A:$BU,15,0)),\"\")","v":0},{"$f":"IFERROR((VLOOKUP($A11,DATABASE!$A:$BU,16,0)),\"\")","v":0},{"$f":"IFERROR((VLOOKUP($A11,DATABASE!$A:$BU,17,0)),\"\")","v":0}]
[8,{"$f":"IFERROR((VLOOKUP($A12,DATABASE!$A:$BU,15,0)),\"\")","v":0},{"$f":"IFERROR((VLOOKUP($A12,DATABASE!$A:$BU,16,0)),\"\")","v":0},{"$f":"IFERROR((VLOOKUP($A12,DATABASE!$A:$BU,17,0)),\"\")","v":0}]
[9,{"$f":"IFERROR((VLOOKUP($A13,DATABASE!$A:$BU,15,0)),\"\")","v":0},{"$f":"IFERROR((VLOOKUP($A13,DATABASE!$A:$BU,16,0)),\"\")","v":0},{"$f":"IFERROR((VLOOKUP($A13,DATABASE!$A:$BU,17,0)),\"\")","v":0}]
[10,{"$f":"IFERROR((VLOOKUP($A14,DATABASE!$A:$BU,15,0)),\"\")","v":0},{"$f":"IFERROR((VLOOKUP($A14,DATABASE!$A:$BU,16,0)),\"\")","v":0},{"$f":"IFERROR((VLOOKUP($A14,DATABASE!$A:$BU,17,0)),\"\")","v":0}]
[11,{"$f":"IFERROR((VLOOKUP($A15,DATABASE!$A:$BU,15,0)),\"\")","v":0},{"$f":"IFERROR((VLOOKUP($A15,DATABASE!$A:$BU,16,0)),\"\")","v":0},{"$f":"IFERROR((VLOOKUP($A15,DATABASE!$A:$BU,17,0)),\"\")","v":0}]
[12,{"$f":"IFERROR((VLOOKUP($A16,DATABASE!$A:$BU,15,0)),\"\")","v":0},{"$f":"IFERROR((VLOOKUP($A16,DATABASE!$A:$BU,16,0)),\"\")","v":0},{"$f":"IFERROR((VLOOKUP($A16,DATABASE!$A:$BU,17,0)),\"\")","v":0}]
[13,{"$f":"IFERROR((VLOOKUP($A17,DATABASE!$A:$BU,15,0)),\"\")","v":0},{"$f":"IFERROR((VLOOKUP($A17,DATABASE!$A:$BU,16,0)),\"\")","v":0},{"$f":"IFERROR((VLOOKUP($A17,DATABASE!$A:$BU,17,0)),\"\")","v":0}]
[14,{"$f":"IFERROR((VLOOKUP($A18,DATABASE!$A:$BU,15,0)),\"\")","v":0},{"$f":"IFERROR((VLOOKUP($A18,DATABASE!$A:$BU,16,0)),\"\")","v":0},{"$f":"IFERROR((VLOOKUP($A18,DATABASE!$A:$BU,17,0)),\"\")","v":0}]
[15,{"$f":"IFERROR((VLOOKUP($A19,DATABASE!$A:$BU,15,0)),\"\")","v":0},{"$f":"IFERROR((VLOOKUP($A19,DATABASE!$A:$BU,16,0)),\"\")","v":0},{"$f":"IFERROR((VLOOKUP($A19,DATABASE!$A:$BU,17,0)),\"\")","v":0}]
[16,{"$f":"IFERROR((VLOOKUP($A20,DATABASE!$A:$BU,15,0)),\"\")","v":0},{"$f":"IFERROR((VLOOKUP($A20,DATABASE!$A:$BU,16,0)),\"\")","v":0},{"$f":"IFERROR((VLOOKUP($A20,DATABASE!$A:$BU,17,0)),\"\")","v":0}]
[17,{"$f":"IFERROR((VLOOKUP($A21,DATABASE!$A:$BU,15,0)),\"\")","v":0},{"$f":"IFERROR((VLOOKUP($A21,DATABASE!$A:$BU,16,0)),\"\")","v":0},{"$f":"IFERROR((VLOOKUP($A21,DATABASE!$A:$BU,17,0)),\"\")","v":0}]
[18,{"$f":"IFERROR((VLOOKUP($A22,DATABASE!$A:$BU,15,0)),\"\")","v":0},{"$f":"IFERROR((VLOOKUP($A22,DATABASE!$A:$BU,16,0)),\"\")","v":0},{"$f":"IFERROR((VLOOKUP($A22,DATABASE!$A:$BU,17,0)),\"\")","v":0}]
[19,{"$f":"IFERROR((VLOOKUP($A23,DATABASE!$A:$BU,15,0)),\"\")","v":0},{"$f":"IFERROR((VLOOKUP($A23,DATABASE!$A:$BU,16,0)),\"\")","v":0},{"$f":"IFERROR((VLOOKUP($A23,DATABASE!$A:$BU,17,0)),\"\")","v":0}]
[20,{"$f":"IFERROR((VLOOKUP($A24,DATABASE!$A:$BU,15,0)),\"\")","v":0},{"$f":"IFERROR((VLOOKUP($A24,DATABASE!$A:$BU,16,0)),\"\")","v":0},{"$f":"IFERROR((VLOOKUP($A24,DATABASE!$A:$BU,17,0)),\"\")","v":0}]
[21,{"$f":"IFERROR((VLOOKUP($A25,DATABASE!$A:$BU,15,0)),\"\")","v":0},{"$f":"IFERROR((VLOOKUP($A25,DATABASE!$A:$BU,16,0)),\"\")","v":0},{"$f":"IFERROR((VLOOKUP($A25,DATABASE!$A:$BU,17,0)),\"\")","v":0}]
[22,{"$f":"IFERROR((VLOOKUP($A26,DATABASE!$A:$BU,15,0)),\"\")","v":0},{"$f":"IFERROR((VLOOKUP($A26,DATABASE!$A:$BU,16,0)),\"\")","v":0},{"$f":"IFERROR((VLOOKUP($A26,DATABASE!$A:$BU,17,0)),\"\")","v":0}]
[23,{"$f":"IFERROR((VLOOKUP($A27,DATABASE!$A:$BU,15,0)),\"\")","v":0},{"$f":"IFERROR((VLOOKUP($A27,DATABASE!$A:$BU,16,0)),\"\")","v":0},{"$f":"IFERROR((VLOOKUP($A27,DATABASE!$A:$BU,17,0)),\"\")","v":0}]
[24,{"$f":"IFERROR((VLOOKUP($A28,DATABASE!$A:$BU,15,0)),\"\")","v":0},{"$f":"IFERROR((VLOOKUP($A28,DATABASE!$A:$BU,16,0)),\"\")","v":0},{"$f":"IFERROR((VLOOKUP($A28,DATABASE!$A:$BU,17,0)),\"\")","v":0}]
[25,{"$f":"IFERROR((VLOOKUP($A29,DATABASE!$A:$BU,15,0)),\"\")","v":0},{"$f":"IFERROR((VLOOKUP($A29,DATABASE!$A:$BU,16,0)),\"\")","v":0},{"$f":"IFERROR((VLOOKUP($A29,DATABASE!$A:$BU,17,0)),\"\")","v":0}]
[26,{"$f":"IFERROR((VLOOKUP($A30,DATABASE!$A:$BU,15,0)),\"\")","v":0},{"$f":"IFERROR((VLOOKUP($A30,DATABASE!$A:$BU,16,0)),\"\")","v":0},{"$f":"IFERROR((VLOOKUP($A30,DATABASE!$A:$BU,17,0)),\"\")","v":0}]
[27,{"$f":"IFERROR((VLOOKUP($A31,DATABASE!$A:$BU,15,0)),\"\")","v":0},{"$f":"IFERROR((VLOOKUP($A31,DATABASE!$A:$BU,16,0)),\"\")","v":0},{"$f":"IFERROR((VLOOKUP($A31,DATABASE!$A:$BU,17,0)),\"\")","v":0}]
[28,{"$f":"IFERROR((VLOOKUP($A32,DATABASE!$A:$BU,15,0)),\"\")","v":0},{"$f":"IFERROR((VLOOKUP($A32,DATABASE!$A:$BU,16,0)),\"\")","v":0},{"$f":"IFERROR((VLOOKUP($A32,DATABASE!$A:$BU,17,0)),\"\")","v":0}]
[29,{"$f":"IFERROR((VLOOKUP($A33,DATABASE!$A:$BU,15,0)),\"\")","v":0},{"$f":"IFERROR((VLOOKUP($A33,DATABASE!$A:$BU,16,0)),\"\")","v":0},{"$f":"IFERROR((VLOOKUP($A33,DATABASE!$A:$BU,17,0)),\"\")","v":0}]
[30,{"$f":"IFERROR((VLOOKUP($A34,DATABASE!$A:$BU,15,0)),\"\")","v":0},{"$f":"IFERROR((VLOOKUP($A34,DATABASE!$A:$BU,16,0)),\"\")","v":0},{"$f":"IFERROR((VLOOKUP($A34,DATABASE!$A:$BU,17,0)),\"\")","v":0}]
[31,{"$f":"IFERROR((VLOOKUP($A35,DATABASE!$A:$BU,15,0)),\"\")","v":0},{"$f":"IFERROR((VLOOKUP($A35,DATABASE!$A:$BU,16,0)),\"\")","v":0},{"$f":"IFERROR((VLOOKUP($A35,DATABASE!$A:$BU,17,0)),\"\")","v":0}]
[32,{"$f":"IFERROR((VLOOKUP($A36,DATABASE!$A:$BU,15,0)),\"\")","v":0},{"$f":"IFERROR((VLOOKUP($A36,DATABASE!$A:$BU,16,0)),\"\")","v":0},{"$f":"IFERROR((VLOOKUP($A36,DATABASE!$A:$BU,17,0)),\"\")","v":0}]
[33,{"$f":"IFERROR((VLOOKUP($A37,DATABASE!$A:$BU,15,0)),\"\")","v":0},{"$f":"IFERROR((VLOOKUP($A37,DATABASE!$A:$BU,16,0)),\"\")","v":0},{"$f":"IFERROR((VLOOKUP($A37,DATABASE!$A:$BU,17,0)),\"\")","v":0}]
[34,{"$f":"IFERROR((VLOOKUP($A38,DATABASE!$A:$BU,15,0)),\"\")","v":0},{"$f":"IFERROR((VLOOKUP($A38,DATABASE!$A:$BU,16,0)),\"\")","v":0},{"$f":"IFERROR((VLOOKUP($A38,DATABASE!$A:$BU,17,0)),\"\")","v":0}]
[35,{"$f":"IFERROR((VLOOKUP($A39,DATABASE!$A:$BU,15,0)),\"\")","v":0},{"$f":"IFERROR((VLOOKUP($A39,DATABASE!$A:$BU,16,0)),\"\")","v":0},{"$f":"IFERROR((VLOOKUP($A39,DATABASE!$A:$BU,17,0)),\"\")","v":0}]
[36,{"$f":"IFERROR((VLOOKUP($A40,DATABASE!$A:$BU,15,0)),\"\")","v":0},{"$f":"IFERROR((VLOOKUP($A40,DATABASE!$A:$BU,16,0)),\"\")","v":0},{"$f":"IFERROR((VLOOKUP($A40,DATABASE!$A:$BU,17,0)),\"\")","v":0}]
[37,{"$f":"IFERROR((VLOOKUP($A41,DATABASE!$A:$BU,15,0)),\"\")","v":0},{"$f":"IFERROR((VLOOKUP($A41,DATABASE!$A:$BU,16,0)),\"\")","v":0},{"$f":"IFERROR((VLOOKUP($A41,DATABASE!$A:$BU,17,0)),\"\")","v":0}]
[38,{"$f":"IFERROR((VLOOKUP($A42,DATABASE!$A:$BU,15,0)),\"\")","v":0},{"$f":"IFERROR((VLOOKUP($A42,DATABASE!$A:$BU,16,0)),\"\")","v":0},{"$f":"IFERROR((VLOOKUP($A42,DATABASE!$A:$BU,17,0)),\"\")","v":0}]
[39,{"$f":"IFERROR((VLOOKUP($A43,DATABASE!$A:$BU,15,0)),\"\")","v":0},{"$f":"IFERROR((VLOOKUP($A43,DATABASE!$A:$BU,16,0)),\"\")","v":0},{"$f":"IFERROR((VLOOKUP($A43,DATABASE!$A:$BU,17,0)),\"\")","v":0}]
[40,{"$f":"IFERROR((VLOOKUP($A44,DATABASE!$A:$BU,15,0)),\"\")","v":0},{"$f":"IFERROR((VLOOKUP($A44,DATABASE!$A:$BU,16,0)),\"\")","v":0},{"$f":"IFERROR((VLOOKUP($A44,DATABASE!$A:$BU,17,0)),\"\")","v":0}]
[41,{"$f":"IFERROR((VLOOKUP($A45,DATABASE!$A:$BU,15,0)),\"\")","v":0},{"$f":"IFERROR((VLOOKUP($A45,DATABASE!$A:$BU,16,0)),\"\")","v":0},{"$f":"IFERROR((VLOOKUP($A45,DATABASE!$A:$BU,17,0)),\"\")","v":0}]
[42,{"$f":"IFERROR((VLOOKUP($A46,DATABASE!$A:$BU,15,0)),\"\")","v":0},{"$f":"IFERROR((VLOOKUP($A46,DATABASE!$A:$BU,16,0)),\"\")","v":0},{"$f":"IFERROR((VLOOKUP($A46,DATABASE!$A:$BU,17,0)),\"\")","v":0}]
[43,{"$f":"IFERROR((VLOOKUP($A47,DATABASE!$A:$BU,15,0)),\"\")","v":0},{"$f":"IFERROR((VLOOKUP($A47,DATABASE!$A:$BU,16,0)),\"\")","v":0},{"$f":"IFERROR((VLOOKUP($A47,DATABASE!$A:$BU,17,0)),\"\")","v":0}]
[44,{"$f":"IFERROR((VLOOKUP($A48,DATABASE!$A:$BU,15,0)),\"\")","v":0},{"$f":"IFERROR((VLOOKUP($A48,DATABASE!$A:$BU,16,0)),\"\")","v":0},{"$f":"IFERROR((VLOOKUP($A48,DATABASE!$A:$BU,17,0)),\"\")","v":0}]
[45,{"$f":"IFERROR((VLOOKUP($A49,DATABASE!$A:$BU,15,0)),\"\")","v":0},{"$f":"IFERROR((VLOOKUP($A49,DATABASE!$A:$BU,16,0)),\"\")","v":0},{"$f":"IFERROR((VLOOKUP($A49,DATABASE!$A:$BU,17,0)),\"\")","v":0}]
[46,{"$f":"IFERROR((VLOOKUP($A50,DATABASE!$A:$BU,15,0)),\"\")","v":0},{"$f":"IFERROR((VLOOKUP($A50,DATABASE!$A:$BU,16,0)),\"\")","v":0},{"$f":"IFERROR((VLOOKUP($A50,DATABASE!$A:$BU,17,0)),\"\")","v":0}]
[47,{"$f":"IFERROR((VLOOKUP($A51,DATABASE!$A:$BU,15,0)),\"\")","v":0},{"$f":"IFERROR((VLOOKUP($A51,DATABASE!$A:$BU,16,0)),\"\")","v":0},{"$f":"IFERROR((VLOOKUP($A51,DATABASE!$A:$BU,17,0)),\"\")","v":0}]
[48,{"$f":"IFERROR((VLOOKUP($A52,DATABASE!$A:$BU,15,0)),\"\")","v":0},{"$f":"IFERROR((VLOOKUP($A52,DATABASE!$A:$BU,16,0)),\"\")","v":0},{"$f":"IFERROR((VLOOKUP($A52,DATABASE!$A:$BU,17,0)),\"\")","v":0}]
[49,{"$f":"IFERROR((VLOOKUP($A53,DATABASE!$A:$BU,15,0)),\"\")","v":0},{"$f":"IFERROR((VLOOKUP($A53,DATABASE!$A:$BU,16,0)),\"\")","v":0},{"$f":"IFERROR((VLOOKUP($A53,DATABASE!$A:$BU,17,0)),\"\")","v":0}]
[50,{"$f":"IFERROR((VLOOKUP($A54,DATABASE!$A:$BU,15,0)),\"\")","v":0},{"$f":"IFERROR((VLOOKUP($A54,DATABASE!$A:$BU,16,0)),\"\")","v":0},{"$f":"IFERROR((VLOOKUP($A54,DATABASE!$A:$BU,17,0)),\"\")","v":0}]
[51,{"$f":"IFERROR((VLOOKUP($A55,DATABASE!$A:$BU,15,0)),\"\")","v":0},{"$f":"IFERROR((VLOOKUP($A55,DATABASE!$A:$BU,16,0)),\"\")","v":0},{"$f":"IFERROR((VLOOKUP($A55,DATABASE!$A:$BU,17,0)),\"\")","v":0}]
[52,{"$f":"IFERROR((VLOOKUP($A56,DATABASE!$A:$BU,15,0)),\"\")","v":0},{"$f":"IFERROR((VLOOKUP($A56,DATABASE!$A:$BU,16,0)),\"\")","v":0},{"$f":"IFERROR((VLOOKUP($A56,DATABASE!$A:$BU,17,0)),\"\")","v":0}]
[53,{"$f":"IFERROR((VLOOKUP($A57,DATABASE!$A:$BU,15,0)),\"\")","v":0},{"$f":"IFERROR((VLOOKUP($A57,DATABASE!$A:$BU,16,0)),\"\")","v":0},{"$f":"IFERROR((VLOOKUP($A57,DATABASE!$A:$BU,17,0)),\"\")","v":0}]
[54,{"$f":"IFERROR((VLOOKUP($A58,DATABASE!$A:$BU,15,0)),\"\")","v":0},{"$f":"IFERROR((VLOOKUP($A58,DATABASE!$A:$BU,16,0)),\"\")","v":0},{"$f":"IFERROR((VLOOKUP($A58,DATABASE!$A:$BU,17,0)),\"\")","v":0}]
[55,{"$f":"IFERROR((VLOOKUP($A59,DATABASE!$A:$BU,15,0)),\"\")","v":0},{"$f":"IFERROR((VLOOKUP($A59,DATABASE!$A:$BU,16,0)),\"\")","v":0},{"$f":"IFERROR((VLOOKUP($A59,DATABASE!$A:$BU,17,0)),\"\")","v":0}]
[56,{"$f":"IFERROR((VLOOKUP($A60,DATABASE!$A:$BU,15,0)),\"\")","v":0},{"$f":"IFERROR((VLOOKUP($A60,DATABASE!$A:$BU,16,0)),\"\")","v":0},{"$f":"IFERROR((VLOOKUP($A60,DATABASE!$A:$BU,17,0)),\"\")","v":0}]
[57,{"$f":"IFERROR((VLOOKUP($A61,DATABASE!$A:$BU,15,0)),\"\")","v":0},{"$f":"IFERROR((VLOOKUP($A61,DATABASE!$A:$BU,16,0)),\"\")","v":0},{"$f":"IFERROR((VLOOKUP($A61,DATABASE!$A:$BU,17,0)),\"\")","v":0}]
[58,{"$f":"IFERROR((VLOOKUP($A62,DATABASE!$A:$BU,15,0)),\"\")","v":0},{"$f":"IFERROR((VLOOKUP($A62,DATABASE!$A:$BU,16,0)),\"\")","v":0},{"$f":"IFERROR((VLOOKUP($A62,DATABASE!$A:$BU,17,0)),\"\")","v":0}]
[59,{"$f":"IFERROR((VLOOKUP($A63,DATABASE!$A:$BU,15,0)),\"\")","v":0},{"$f":"IFERROR((VLOOKUP($A63,DATABASE!$A:$BU,16,0)),\"\")","v":0},{"$f":"IFERROR((VLOOKUP($A63,DATABASE!$A:$BU,17,0)),\"\")","v":0}]
[60,{"$f":"IFERROR((VLOOKUP($A64,DATABASE!$A:$BU,15,0)),\"\")","v":0},{"$f":"IFERROR((VLOOKUP($A64,DATABASE!$A:$BU,16,0)),\"\")","v":0},{"$f":"IFERROR((VLOOKUP($A64,DATABASE!$A:$BU,17,0)),\"\")","v":0}]
[61,{"$f":"IFERROR((VLOOKUP($A65,DATABASE!$A:$BU,15,0)),\"\")","v":0},{"$f":"IFERROR((VLOOKUP($A65,DATABASE!$A:$BU,16,0)),\"\")","v":0},{"$f":"IFERROR((VLOOKUP($A65,DATABASE!$A:$BU,17,0)),\"\")","v":0}]
[62,{"$f":"IFERROR((VLOOKUP($A66,DATABASE!$A:$BU,15,0)),\"\")","v":0},{"$f":"IFERROR((VLOOKUP($A66,DATABASE!$A:$BU,16,0)),\"\")","v":0},{"$f":"IFERROR((VLOOKUP($A66,DATABASE!$A:$BU,17,0)),\"\")","v":0}]
[63,{"$f":"IFERROR((VLOOKUP($A67,DATABASE!$A:$BU,15,0)),\"\")","v":0},{"$f":"IFERROR((VLOOKUP($A67,DATABASE!$A:$BU,16,0)),\"\")","v":0},{"$f":"IFERROR((VLOOKUP($A67,DATABASE!$A:$BU,17,0)),\"\")","v":0}]
[64,{"$f":"IFERROR((VLOOKUP($A68,DATABASE!$A:$BU,15,0)),\"\")","v":0},{"$f":"IFERROR((VLOOKUP($A68,DATABASE!$A:$BU,16,0)),\"\")","v":0},{"$f":"IFERROR((VLOOKUP($A68,DATABASE!$A:$BU,17,0)),\"\")","v":0}]
[65,{"$f":"IFERROR((VLOOKUP($A69,DATABASE!$A:$BU,15,0)),\"\")","v":0},{"$f":"IFERROR((VLOOKUP($A69,DATABASE!$A:$BU,16,0)),\"\")","v":0},{"$f":"IFERROR((VLOOKUP($A69,DATABASE!$A:$BU,17,0)),\"\")","v":0}]
[66,{"$f":"IFERROR((VLOOKUP($A70,DATABASE!$A:$BU,15,0)),\"\")","v":0},{"$f":"IFERROR((VLOOKUP($A70,DATABASE!$A:$BU,16,0)),\"\")","v":0},{"$f":"IFERROR((VLOOKUP($A70,DATABASE!$A:$BU,17,0)),\"\")","v":0}]
[67,{"$f":"IFERROR((VLOOKUP($A71,DATABASE!$A:$BU,15,0)),\"\")","v":0},{"$f":"IFERROR((VLOOKUP($A71,DATABASE!$A:$BU,16,0)),\"\")","v":0},{"$f":"IFERROR((VLOOKUP($A71,DATABASE!$A:$BU,17,0)),\"\")","v":0}]
[68,{"$f":"IFERROR((VLOOKUP($A72,DATABASE!$A:$BU,15,0)),\"\")","v":0},{"$f":"IFERROR((VLOOKUP($A72,DATABASE!$A:$BU,16,0)),\"\")","v":0},{"$f":"IFERROR((VLOOKUP($A72,DATABASE!$A:$BU,17,0)),\"\")","v":0}]
[69,{"$f":"IFERROR((VLOOKUP($A73,DATABASE!$A:$BU,15,0)),\"\")","v":0},{"$f":"IFERROR((VLOOKUP($A73,DATABASE!$A:$BU,16,0)),\"\")","v":0},{"$f":"IFERROR((VLOOKUP($A73,DATABASE!$A:$BU,17,0)),\"\")","v":0}]
[70,{"$f":"IFERROR((VLOOKUP($A74,DATABASE!$A:$BU,15,0)),\"\")","v":0},{"$f":"IFERROR((VLOOKUP($A74,DATABASE!$A:$BU,16,0)),\"\")","v":0},{"$f":"IFERROR((VLOOKUP($A74,DATABASE!$A:$BU,17,0)),\"\")","v":0}]
[71,{"$f":"IFERROR((VLOOKUP($A75,DATABASE!$A:$BU,15,0)),\"\")","v":0},{"$f":"IFERROR((VLOOKUP($A75,DATABASE!$A:$BU,16,0)),\"\")","v":0},{"$f":"IFERROR((VLOOKUP($A75,DATABASE!$A:$BU,17,0)),\"\")","v":0}]
[72,{"$f":"IFERROR((VLOOKUP($A76,DATABASE!$A:$BU,15,0)),\"\")","v":0},{"$f":"IFERROR((VLOOKUP($A76,DATABASE!$A:$BU,16,0)),\"\")","v":0},{"$f":"IFERROR((VLOOKUP($A76,DATABASE!$A:$BU,17,0)),\"\")","v":0}]
[73,{"$f":"IFERROR((VLOOKUP($A77,DATABASE!$A:$BU,15,0)),\"\")","v":0},{"$f":"IFERROR((VLOOKUP($A77,DATABASE!$A:$BU,16,0)),\"\")","v":0},{"$f":"IFERROR((VLOOKUP($A77,DATABASE!$A:$BU,17,0)),\"\")","v":0}]
[74,{"$f":"IFERROR((VLOOKUP($A78,DATABASE!$A:$BU,15,0)),\"\")","v":0},{"$f":"IFERROR((VLOOKUP($A78,DATABASE!$A:$BU,16,0)),\"\")","v":0},{"$f":"IFERROR((VLOOKUP($A78,DATABASE!$A:$BU,17,0)),\"\")","v":0}]
[75,{"$f":"IFERROR((VLOOKUP($A79,DATABASE!$A:$BU,15,0)),\"\")","v":0},{"$f":"IFERROR((VLOOKUP($A79,DATABASE!$A:$BU,16,0)),\"\")","v":0},{"$f":"IFERROR((VLOOKUP($A79,DATABASE!$A:$BU,17,0)),\"\")","v":0}]
[76,{"$f":"IFERROR((VLOOKUP($A80,DATABASE!$A:$BU,15,0)),\"\")","v":0},{"$f":"IFERROR((VLOOKUP($A80,DATABASE!$A:$BU,16,0)),\"\")","v":0},{"$f":"IFERROR((VLOOKUP($A80,DATABASE!$A:$BU,17,0)),\"\")","v":0}]
[77,{"$f":"IFERROR((VLOOKUP($A81,DATABASE!$A:$BU,15,0)),\"\")","v":0},{"$f":"IFERROR((VLOOKUP($A81,DATABASE!$A:$BU,16,0)),\"\")","v":0},{"$f":"IFERROR((VLOOKUP($A81,DATABASE!$A:$BU,17,0)),\"\")","v":0}]
[78,{"$f":"IFERROR((VLOOKUP($A82,DATABASE!$A:$BU,15,0)),\"\")","v":0},{"$f":"IFERROR((VLOOKUP($A82,DATABASE!$A:$BU,16,0)),\"\")","v":0},{"$f":"IFERROR((VLOOKUP($A82,DATABASE!$A:$BU,17,0)),\"\")","v":0}]
[79,{"$f":"IFERROR((VLOOKUP($A83,DATABASE!$A:$BU,15,0)),\"\")","v":0},{"$f":"IFERROR((VLOOKUP($A83,DATABASE!$A:$BU,16,0)),\"\")","v":0},{"$f":"IFERROR((VLOOKUP($A83,DATABASE!$A:$BU,17,0)),\"\")","v":0}]
[80,{"$f":"IFERROR((VLOOKUP($A84,DATABASE!$A:$BU,15,0)),\"\")","v":0},{"$f":"IFERROR((VLOOKUP($A84,DATABASE!$A:$BU,16,0)),\"\")","v":0},{"$f":"IFERROR((VLOOKUP($A84,DATABASE!$A:$BU,17,0)),\"\")","v":0}]
[81,{"$f":"IFERROR((VLOOKUP($A85,DATABASE!$A:$BU,15,0)),\"\")","v":0},{"$f":"IFERROR((VLOOKUP($A85,DATABASE!$A:$BU,16,0)),\"\")","v":0},{"$f":"IFERROR((VLOOKUP($A85,DATABASE!$A:$BU,17,0)),\"\")","v":0}]
[82,{"$f":"IFERROR((VLOOKUP($A86,DATABASE!$A:$BU,15,0)),\"\")","v":0},{"$f":"IFERROR((VLOOKUP($A86,DATABASE!$A:$BU,16,0)),\"\")","v":0},{"$f":"IFERROR((VLOOKUP($A86,DATABASE!$A:$BU,17,0)),\"\")","v":0}]
[83,{"$f":"IFERROR((VLOOKUP($A87,DATABASE!$A:$BU,15,0)),\"\")","v":0},{"$f":"IFERROR((VLOOKUP($A87,DATABASE!$A:$BU,16,0)),\"\")","v":0},{"$f":"IFERROR((VLOOKUP($A87,DATABASE!$A:$BU,17,0)),\"\")","v":0}]
[84,{"$f":"IFERROR((VLOOKUP($A88,DATABASE!$A:$BU,15,0)),\"\")","v":0},{"$f":"IFERROR((VLOOKUP($A88,DATABASE!$A:$BU,16,0)),\"\")","v":0},{"$f":"IFERROR((VLOOKUP($A88,DATABASE!$A:$BU,17,0)),\"\")","v":0}]
[85,{"$f":"IFERROR((VLOOKUP($A89,DATABASE!$A:$BU,15,0)),\"\")","v":0},{"$f":"IFERROR((VLOOKUP($A89,DATABASE!$A:$BU,16,0)),\"\")","v":0},{"$f":"IFERROR((VLOOKUP($A89,DATABASE!$A:$BU,17,0)),\"\")","v":0}]
[86,{"$f":"IFERROR((VLOOKUP($A90,DATABASE!$A:$BU,15,0)),\"\")","v":0},{"$f":"IFERROR((VLOOKUP($A90,DATABASE!$A:$BU,16,0)),\"\")","v":0},{"$f":"IFERROR((VLOOKUP($A90,DATABASE!$A:$BU,17,0)),\"\")","v":0}]
[87,{"$f":"IFERROR((VLOOKUP($A91,DATABASE!$A:$BU,15,0)),\"\")","v":0},{"$f":"IFERROR((VLOOKUP($A91,DATABASE!$A:$BU,16,0)),\"\")","v":0},{"$f":"IFERROR((VLOOKUP($A91,DATABASE!$A:$BU,17,0)),\"\")","v":0}]
[88,{"$f":"IFERROR((VLOOKUP($A92,DATABASE!$A:$BU,15,0)),\"\")","v":0},{"$f":"IFERROR((VLOOKUP($A92,DATABASE!$A:$BU,16,0)),\"\")","v":0},{"$f":"IFERROR((VLOOKUP($A92,DATABASE!$A:$BU,17,0)),\"\")","v":0}]
[89,{"$f":"IFERROR((VLOOKUP($A93,DATABASE!$A:$BU,15,0)),\"\")","v":0},{"$f":"IFERROR((VLOOKUP($A93,DATABASE!$A:$BU,16,0)),\"\")","v":0},{"$f":"IFERROR((VLOOKUP($A93,DATABASE!$A:$BU,17,0)),\"\")","v":0}]
[90,{"$f":"IFERROR((VLOOKUP($A94,DATABASE!$A:$BU,15,0)),\"\")","v":0},{"$f":"IFERROR((VLOOKUP($A94,DATABASE!$A:$BU,16,0)),\"\")","v":0},{"$f":"IFERROR((VLOOKUP($A94,DATABASE!$A:$BU,17,0)),\"\")","v":0}]
[91,{"$f":"IFERROR((VLOOKUP($A95,DATABASE!$A:$BU,15,0)),\"\")","v":0},{"$f":"IFERROR((VLOOKUP($A95,DATABASE!$A:$BU,16,0)),\"\")","v":0},{"$f":"IFERROR((VLOOKUP($A95,DATABASE!$A:$BU,17,0)),\"\")","v":0}]
[92,{"$f":"IFERROR((VLOOKUP($A96,DATABASE!$A:$BU,15,0)),\"\")","v":0},{"$f":"IFERROR((VLOOKUP($A96,DATABASE!$A:$BU,16,0)),\"\")","v":0},{"$f":"IFERROR((VLOOKUP($A96,DATABASE!$A:$BU,17,0)),\"\")","v":0}]
[93,{"$f":"IFERROR((VLOOKUP($A97,DATABASE!$A:$BU,15,0)),\"\")","v":0},{"$f":"IFERROR((VLOOKUP($A97,DATABASE!$A:$BU,16,0)),\"\")","v":0},{"$f":"IFERROR((VLOOKUP($A97,DATABASE!$A:$BU,17,0)),\"\")","v":0}]
[94,{"$f":"IFERROR((VLOOKUP($A98,DATABASE!$A:$BU,15,0)),\"\")","v":0},{"$f":"IFERROR((VLOOKUP($A98,DATABASE!$A:$BU,16,0)),\"\")","v":0},{"$f":"IFERROR((VLOOKUP($A98,DATABASE!$A:$BU,17,0)),\"\")","v":0}]
[95,{"$f":"IFERROR((VLOOKUP($A99,DATABASE!$A:$BU,15,0)),\"\")","v":0},{"$f":"IFERROR((VLOOKUP($A99,DATABASE!$A:$BU,16,0)),\"\")","v":0},{"$f":"IFERROR((VLOOKUP($A99,DATABASE!$A:$BU,17,0)),\"\")","v":0}]
[96,{"$f":"IFERROR((VLOOKUP($A100,DATABASE!$A:$BU,15,0)),\"\")","v":0},{"$f":"IFERROR((VLOOKUP($A100,DATABASE!$A:$BU,16,0)),\"\")","v":0},{"$f":"IFERROR((VLOOKUP($A100,DATABASE!$A:$BU,17,0)),\"\")","v":0}]
[97,{"$f":"IFERROR((VLOOKUP($A101,DATABASE!$A:$BU,15,0)),\"\")","v":0},{"$f":"IFERROR((VLOOKUP($A101,DATABASE!$A:$BU,16,0)),\"\")","v":0},{"$f":"IFERROR((VLOOKUP($A101,DATABASE!$A:$BU,17,0)),\"\")","v":0}]
[98,{"$f":"IFERROR((VLOOKUP($A102,DATABASE!$A:$BU,15,0)),\"\")","v":0},{"$f":"IFERROR((VLOOKUP($A102,DATABASE!$A:$BU,16,0)),\"\")","v":0},{"$f":"IFERROR((VLOOKUP($A102,DATABASE!$A:$BU,17,0)),\"\")","v":0}]
[99,{"$f":"IFERROR((VLOOKUP($A103,DATABASE!$A:$BU,15,0)),\"\")","v":0},{"$f":"IFERROR((VLOOKUP($A103,DATABASE!$A:$BU,16,0)),\"\")","v":0},{"$f":"IFERROR((VLOOKUP($A103,DATABASE!$A:$BU,17,0)),\"\")","v":0}]
[100,{"$f":"IFERROR((VLOOKUP($A104,DATABASE!$A:$BU,15,0)),\"\")","v":0},{"$f":"IFERROR((VLOOKUP($A104,DATABASE!$A:$BU,16,0)),\"\")","v":0},{"$f":"IFERROR((VLOOKUP($A104,DATABASE!$A:$BU,17,0)),\"\")","v":0}]
[101,{"$f":"IFERROR((VLOOKUP($A105,DATABASE!$A:$BU,15,0)),\"\")","v":0},{"$f":"IFERROR((VLOOKUP($A105,DATABASE!$A:$BU,16,0)),\"\")","v":0},{"$f":"IFERROR((VLOOKUP($A105,DATABASE!$A:$BU,17,0)),\"\")","v":0}]
[102,{"$f":"IFERROR((VLOOKUP($A106,DATABASE!$A:$BU,15,0)),\"\")","v":0},{"$f":"IFERROR((VLOOKUP($A106,DATABASE!$A:$BU,16,0)),\"\")","v":0},{"$f":"IFERROR((VLOOKUP($A106,DATABASE!$A:$BU,17,0)),\"\")","v":0}]
[103,{"$f":"IFERROR((VLOOKUP($A107,DATABASE!$A:$BU,15,0)),\"\")","v":0},{"$f":"IFERROR((VLOOKUP($A107,DATABASE!$A:$BU,16,0)),\"\")","v":0},{"$f":"IFERROR((VLOOKUP($A107,DATABASE!$A:$BU,17,0)),\"\")","v":0}]
[104,{"$f":"IFERROR((VLOOKUP($A108,DATABASE!$A:$BU,15,0)),\"\")","v":0},{"$f":"IFERROR((VLOOKUP($A108,DATABASE!$A:$BU,16,0)),\"\")","v":0},{"$f":"IFERROR((VLOOKUP($A108,DATABASE!$A:$BU,17,0)),\"\")","v":0}]
[105,{"$f":"IFERROR((VLOOKUP($A109,DATABASE!$A:$BU,15,0)),\"\")","v":0},{"$f":"IFERROR((VLOOKUP($A109,DATABASE!$A:$BU,16,0)),\"\")","v":0},{"$f":"IFERROR((VLOOKUP($A109,DATABASE!$A:$BU,17,0)),\"\")","v":0}]
[106,{"$f":"IFERROR((VLOOKUP($A110,DATABASE!$A:$BU,15,0)),\"\")","v":0},{"$f":"IFERROR((VLOOKUP($A110,DATABASE!$A:$BU,16,0)),\"\")","v":0},{"$f":"IFERROR((VLOOKUP($A110,DATABASE!$A:$BU,17,0)),\"\")","v":0}]
[107,{"$f":"IFERROR((VLOOKUP($A111,DATABASE!$A:$BU,15,0)),\"\")","v":0},{"$f":"IFERROR((VLOOKUP($A111,DATABASE!$A:$BU,16,0)),\"\")","v":0},{"$f":"IFERROR((VLOOKUP($A111,DATABASE!$A:$BU,17,0)),\"\")","v":0}]
[108,{"$f":"IFERROR((VLOOKUP($A112,DATABASE!$A:$BU,15,0)),\"\")","v":0},{"$f":"IFERROR((VLOOKUP($A112,DATABASE!$A:$BU,16,0)),\"\")","v":0},{"$f":"IFERROR((VLOOKUP($A112,DATABASE!$A:$BU,17,0)),\"\")","v":0}]
[109,{"$f":"IFERROR((VLOOKUP($A113,DATABASE!$A:$BU,15,0)),\"\")","v":0},{"$f":"IFERROR((VLOOKUP($A113,DATABASE!$A:$BU,16,0)),\"\")","v":0},{"$f":"IFERROR((VLOOKUP($A113,DATABASE!$A:$BU,17,0)),\"\")","v":0}]
[110,{"$f":"IFERROR((VLOOKUP($A114,DATABASE!$A:$BU,15,0)),\"\")","v":0},{"$f":"IFERROR((VLOOKUP($A114,DATABASE!$A:$BU,16,0)),\"\")","v":0},{"$f":"IFERROR((VLOOKUP($A114,DATABASE!$A:$BU,17,0)),\"\")","v":0}]
[111,{"$f":"IFERROR((VLOOKUP($A115,DATABASE!$A:$BU,15,0)),\"\")","v":0},{"$f":"IFERROR((VLOOKUP($A115,DATABASE!$A:$BU,16,0)),\"\")","v":0},{"$f":"IFERROR((VLOOKUP($A115,DATABASE!$A:$BU,17,0)),\"\")","v":0}]
[112,{"$f":"IFERROR((VLOOKUP($A116,DATABASE!$A:$BU,15,0)),\"\")","v":0},{"$f":"IFERROR((VLOOKUP($A116,DATABASE!$A:$BU,16,0)),\"\")","v":0},{"$f":"IFERROR((VLOOKUP($A116,DATABASE!$A:$BU,17,0)),\"\")","v":0}]
[113,{"$f":"IFERROR((VLOOKUP($A117,DATABASE!$A:$BU,15,0)),\"\")","v":0},{"$f":"IFERROR((VLOOKUP($A117,DATABASE!$A:$BU,16,0)),\"\")","v":0},{"$f":"IFERROR((VLOOKUP($A117,DATABASE!$A:$BU,17,0)),\"\")","v":0}]
[114,{"$f":"IFERROR((VLOOKUP($A118,DATABASE!$A:$BU,15,0)),\"\")","v":0},{"$f":"IFERROR((VLOOKUP($A118,DATABASE!$A:$BU,16,0)),\"\")","v":0},{"$f":"IFERROR((VLOOKUP($A118,DATABASE!$A:$BU,17,0)),\"\")","v":0}]
[115,{"$f":"IFERROR((VLOOKUP($A119,DATABASE!$A:$BU,15,0)),\"\")","v":0},{"$f":"IFERROR((VLOOKUP($A119,DATABASE!$A:$BU,16,0)),\"\")","v":0},{"$f":"IFERROR((VLOOKUP($A119,DATABASE!$A:$BU,17,0)),\"\")","v":0}]
[116,{"$f":"IFERROR((VLOOKUP($A120,DATABASE!$A:$BU,15,0)),\"\")","v":0},{"$f":"IFERROR((VLOOKUP($A120,DATABASE!$A:$BU,16,0)),\"\")","v":0},{"$f":"IFERROR((VLOOKUP($A120,DATABASE!$A:$BU,17,0)),\"\")","v":0}]
[117,{"$f":"IFERROR((VLOOKUP($A121,DATABASE!$A:$BU,15,0)),\"\")","v":0},{"$f":"IFERROR((VLOOKUP($A121,DATABASE!$A:$BU,16,0)),\"\")","v":0},{"$f":"IFERROR((VLOOKUP($A121,DATABASE!$A:$BU,17,0)),\"\")","v":0}]
[118,{"$f":"IFERROR((VLOOKUP($A122,DATABASE!$A:$BU,15,0)),\"\")","v":0},{"$f":"IFERROR((VLOOKUP($A122,DATABASE!$A:$BU,16,0)),\"\")","v":0},{"$f":"IFERROR((VLOOKUP($A122,DATABASE!$A:$BU,17,0)),\"\")","v":0}]
[119,{"$f":"IFERROR((VLOOKUP($A123,DATABASE!$A:$BU,15,0)),\"\")","v":0},{"$f":"IFERROR((VLOOKUP($A123,DATABASE!$A:$BU,16,0)),\"\")","v":0},{"$f":"IFERROR((VLOOKUP($A123,DATABASE!$A:$BU,17,0)),\"\")","v":0}]
[120,{"$f":"IFERROR((VLOOKUP($A124,DATABASE!$A:$BU,15,0)),\"\")","v":0},{"$f":"IFERROR((VLOOKUP($A124,DATABASE!$A:$BU,16,0)),\"\")","v":0},{"$f":"IFERROR((VLOOKUP($A124,DATABASE!$A:$BU,17,0)),\"\")","v":0}]
[121,{"$f":"IFERROR((VLOOKUP($A125,DATABASE!$A:$BU,15,0)),\"\")","v":0},{"$f":"IFERROR((VLOOKUP($A125,DATABASE!$A:$BU,16,0)),\"\")","v":0},{"$f":"IFERROR((VLOOKUP($A125,DATABASE!$A:$BU,17,0)),\"\")","v":0}]
[122,{"$f":"IFERROR((VLOOKUP($A126,DATABASE!$A:$BU,15,0)),\"\")","v":0},{"$f":"IFERROR((VLOOKUP($A126,DATABASE!$A:$BU,16,0)),\"\")","v":0},{"$f":"IFERROR((VLOOKUP($A126,DATABASE!$A:$BU,17,0)),\"\")","v":0}]
[123,{"$f":"IFERROR((VLOOKUP($A127,DATABASE!$A:$BU,15,0)),\"\")","v":0},{"$f":"IFERROR((VLOOKUP($A127,DATABASE!$A:$BU,16,0)),\"\")","v":0},{"$f":"IFERROR((VLOOKUP($A127,DATABASE!$A:$BU,17,0)),\"\")","v":0}]
[124,{"$f":"IFERROR((VLOOKUP($A128,DATABASE!$A:$BU,15,0)),\"\")","v":0},{"$f":"IFERROR((VLOOKUP($A128,DATABASE!$A:$BU,16,0)),\"\")","v":0},{"$f":"IFERROR((VLOOKUP($A128,DATABASE!$A:$BU,17,0)),\"\")","v":0}]
[125,{"$f":"IFERROR((VLOOKUP($A129,DATABASE!$A:$BU,15,0)),\"\")","v":0},{"$f":"IFERROR((VLOOKUP($A129,DATABASE!$A:$BU,16,0)),\"\")","v":0},{"$f":"IFERROR((VLOOKUP($A129,DATABASE!$A:$BU,17,0)),\"\")","v":0}]
[126,{"$f":"IFERROR((VLOOKUP($A130,DATABASE!$A:$BU,15,0)),\"\")","v":0},{"$f":"IFERROR((VLOOKUP($A130,DATABASE!$A:$BU,16,0)),\"\")","v":0},{"$f":"IFERROR((VLOOKUP($A130,DATABASE!$A:$BU,17,0)),\"\")","v":0}]
[127,{"$f":"IFERROR((VLOOKUP($A131,DATABASE!$A:$BU,15,0)),\"\")","v":0},{"$f":"IFERROR((VLOOKUP($A131,DATABASE!$A:$BU,16,0)),\"\")","v":0},{"$f":"IFERROR((VLOOKUP($A131,DATABASE!$A:$BU,17,0)),\"\")","v":0}]
[128,{"$f":"IFERROR((VLOOKUP($A132,DATABASE!$A:$BU,15,0)),\"\")","v":0},{"$f":"IFERROR((VLOOKUP($A132,DATABASE!$A:$BU,16,0)),\"\")","v":0},{"$f":"IFERROR((VLOOKUP($A132,DATABASE!$A:$BU,17,0)),\"\")","v":0}]
[129,{"$f":"IFERROR((VLOOKUP($A133,DATABASE!$A:$BU,15,0)),\"\")","v":0},{"$f":"IFERROR((VLOOKUP($A133,DATABASE!$A:$BU,16,0)),\"\")","v":0},{"$f":"IFERROR((VLOOKUP($A133,DATABASE!$A:$BU,17,0)),\"\")","v":0}]
[130,{"$f":"IFERROR((VLOOKUP($A134,DATABASE!$A:$BU,15,0)),\"\")","v":0},{"$f":"IFERROR((VLOOKUP($A134,DATABASE!$A:$BU,16,0)),\"\")","v":0},{"$f":"IFERROR((VLOOKUP($A134,DATABASE!$A:$BU,17,0)),\"\")","v":0}]
[131,{"$f":"IFERROR((VLOOKUP($A135,DATABASE!$A:$BU,15,0)),\"\")","v":0},{"$f":"IFERROR((VLOOKUP($A135,DATABASE!$A:$BU,16,0)),\"\")","v":0},{"$f":"IFERROR((VLOOKUP($A135,DATABASE!$A:$BU,17,0)),\"\")","v":0}]
[132,{"$f":"IFERROR((VLOOKUP($A136,DATABASE!$A:$BU,15,0)),\"\")","v":0},{"$f":"IFERROR((VLOOKUP($A136,DATABASE!$A:$BU,16,0)),\"\")","v":0},{"$f":"IFERROR((VLOOKUP($A136,DATABASE!$A:$BU,17,0)),\"\")","v":0}]
[133,{"$f":"IFERROR((VLOOKUP($A137,DATABASE!$A:$BU,15,0)),\"\")","v":0},{"$f":"IFERROR((VLOOKUP($A137,DATABASE!$A:$BU,16,0)),\"\")","v":0},{"$f":"IFERROR((VLOOKUP($A137,DATABASE!$A:$BU,17,0)),\"\")","v":0}]
[134,{"$f":"IFERROR((VLOOKUP($A138,DATABASE!$A:$BU,15,0)),\"\")","v":0},{"$f":"IFERROR((VLOOKUP($A138,DATABASE!$A:$BU,16,0)),\"\")","v":0},{"$f":"IFERROR((VLOOKUP($A138,DATABASE!$A:$BU,17,0)),\"\")","v":0}]
[135,{"$f":"IFERROR((VLOOKUP($A139,DATABASE!$A:$BU,15,0)),\"\")","v":0},{"$f":"IFERROR((VLOOKUP($A139,DATABASE!$A:$BU,16,0)),\"\")","v":0},{"$f":"IFERROR((VLOOKUP($A139,DATABASE!$A:$BU,17,0)),\"\")","v":0}]
[136,{"$f":"IFERROR((VLOOKUP($A140,DATABASE!$A:$BU,15,0)),\"\")","v":0},{"$f":"IFERROR((VLOOKUP($A140,DATABASE!$A:$BU,16,0)),\"\")","v":0},{"$f":"IFERROR((VLOOKUP($A140,DATABASE!$A:$BU,17,0)),\"\")","v":0}]
[137,{"$f":"IFERROR((VLOOKUP($A141,DATABASE!$A:$BU,15,0)),\"\")","v":0},{"$f":"IFERROR((VLOOKUP($A141,DATABASE!$A:$BU,16,0)),\"\")","v":0},{"$f":"IFERROR((VLOOKUP($A141,DATABASE!$A:$BU,17,0)),\"\")","v":0}]
[138,{"$f":"IFERROR((VLOOKUP($A142,DATABASE!$A:$BU,15,0)),\"\")","v":0},{"$f":"IFERROR((VLOOKUP($A142,DATABASE!$A:$BU,16,0)),\"\")","v":0},{"$f":"IFERROR((VLOOKUP($A142,DATABASE!$A:$BU,17,0)),\"\")","v":0}]
[139,{"$f":"IFERROR((VLOOKUP($A143,DATABASE!$A:$BU,15,0)),\"\")","v":0},{"$f":"IFERROR((VLOOKUP($A143,DATABASE!$A:$BU,16,0)),\"\")","v":0},{"$f":"IFERROR((VLOOKUP($A143,DATABASE!$A:$BU,17,0)),\"\")","v":0}]
[140,{"$f":"IFERROR((VLOOKUP($A144,DATABASE!$A:$BU,15,0)),\"\")","v":0},{"$f":"IFERROR((VLOOKUP($A144,DATABASE!$A:$BU,16,0)),\"\")","v":0},{"$f":"IFERROR((VLOOKUP($A144,DATABASE!$A:$BU,17,0)),\"\")","v":0}]
[141,{"$f":"IFERROR((VLOOKUP($A145,DATABASE!$A:$BU,15,0)),\"\")","v":0},{"$f":"IFERROR((VLOOKUP($A145,DATABASE!$A:$BU,16,0)),\"\")","v":0},{"$f":"IFERROR((VLOOKUP($A145,DATABASE!$A:$BU,17,0)),\"\")","v":0}]
[142,{"$f":"IFERROR((VLOOKUP($A146,DATABASE!$A:$BU,15,0)),\"\")","v":0},{"$f":"IFERROR((VLOOKUP($A146,DATABASE!$A:$BU,16,0)),\"\")","v":0},{"$f":"IFERROR((VLOOKUP($A146,DATABASE!$A:$BU,17,0)),\"\")","v":0}]
[143,{"$f":"IFERROR((VLOOKUP($A147,DATABASE!$A:$BU,15,0)),\"\")","v":0},{"$f":"IFERROR((VLOOKUP($A147,DATABASE!$A:$BU,16,0)),\"\")","v":0},{"$f":"IFERROR((VLOOKUP($A147,DATABASE!$A:$BU,17,0)),\"\")","v":0}]
[144,{"$f":"IFERROR((VLOOKUP($A148,DATABASE!$A:$BU,15,0)),\"\")","v":0},{"$f":"IFERROR((VLOOKUP($A148,DATABASE!$A:$BU,16,0)),\"\")","v":0},{"$f":"IFERROR((VLOOKUP($A148,DATABASE!$A:$BU,17,0)),\"\")","v":0}]
[145,{"$f":"IFERROR((VLOOKUP($A149,DATABASE!$A:$BU,15,0)),\"\")","v":0},{"$f":"IFERROR((VLOOKUP($A149,DATABASE!$A:$BU,16,0)),\"\")","v":0},{"$f":"IFERROR((VLOOKUP($A149,DATABASE!$A:$BU,17,0)),\"\")","v":0}]
[146,{"$f":"IFERROR((VLOOKUP($A150,DATABASE!$A:$BU,15,0)),\"\")","v":0},{"$f":"IFERROR((VLOOKUP($A150,DATABASE!$A:$BU,16,0)),\"\")","v":0},{"$f":"IFERROR((VLOOKUP($A150,DATABASE!$A:$BU,17,0)),\"\")","v":0}]
[147,{"$f":"IFERROR((VLOOKUP($A151,DATABASE!$A:$BU,15,0)),\"\")","v":0},{"$f":"IFERROR((VLOOKUP($A151,DATABASE!$A:$BU,16,0)),\"\")","v":0},{"$f":"IFERROR((VLOOKUP($A151,DATABASE!$A:$BU,17,0)),\"\")","v":0}]
[148,{"$f":"IFERROR((VLOOKUP($A152,DATABASE!$A:$BU,15,0)),\"\")","v":0},{"$f":"IFERROR((VLOOKUP($A152,DATABASE!$A:$BU,16,0)),\"\")","v":0},{"$f":"IFERROR((VLOOKUP($A152,DATABASE!$A:$BU,17,0)),\"\")","v":0}]
[149,{"$f":"IFERROR((VLOOKUP($A153,DATABASE!$A:$BU,15,0)),\"\")","v":0},{"$f":"IFERROR((VLOOKUP($A153,DATABASE!$A:$BU,16,0)),\"\")","v":0},{"$f":"IFERROR((VLOOKUP($A153,DATABASE!$A:$BU,17,0)),\"\")","v":0}]
[150,{"$f":"IFERROR((VLOOKUP($A154,DATABASE!$A:$BU,15,0)),\"\")","v":0},{"$f":"IFERROR((VLOOKUP($A154,DATABASE!$A:$BU,16,0)),\"\")","v":0},{"$f":"IFERROR((VLOOKUP($A154,DATABASE!$A:$BU,17,0)),\"\")","v":0}]
[151,{"$f":"IFERROR((VLOOKUP($A155,DATABASE!$A:$BU,15,0)),\"\")","v":0},{"$f":"IFERROR((VLOOKUP($A155,DATABASE!$A:$BU,16,0)),\"\")","v":0},{"$f":"IFERROR((VLOOKUP($A155,DATABASE!$A:$BU,17,0)),\"\")","v":0}]
[152,{"$f":"IFERROR((VLOOKUP($A156,DATABASE!$A:$BU,15,0)),\"\")","v":0},{"$f":"IFERROR((VLOOKUP($A156,DATABASE!$A:$BU,16,0)),\"\")","v":0},{"$f":"IFERROR((VLOOKUP($A156,DATABASE!$A:$BU,17,0)),\"\")","v":0}]
[153,{"$f":"IFERROR((VLOOKUP($A157,DATABASE!$A:$BU,15,0)),\"\")","v":0},{"$f":"IFERROR((VLOOKUP($A157,DATABASE!$A:$BU,16,0)),\"\")","v":0},{"$f":"IFERROR((VLOOKUP($A157,DATABASE!$A:$BU,17,0)),\"\")","v":0}]
[154,{"$f":"IFERROR((VLOOKUP($A158,DATABASE!$A:$BU,15,0)),\"\")","v":0},{"$f":"IFERROR((VLOOKUP($A158,DATABASE!$A:$BU,16,0)),\"\")","v":0},{"$f":"IFERROR((VLOOKUP($A158,DATABASE!$A:$BU,17,0)),\"\")","v":0}]
[155,{"$f":"IFERROR((VLOOKUP($A159,DATABASE!$A:$BU,15,0)),\"\")","v":0},{"$f":"IFERROR((VLOOKUP($A159,DATABASE!$A:$BU,16,0)),\"\")","v":0},{"$f":"IFERROR((VLOOKUP($A159,DATABASE!$A:$BU,17,0)),\"\")","v":0}]
[156,{"$f":"IFERROR((VLOOKUP($A160,DATABASE!$A:$BU,15,0)),\"\")","v":0},{"$f":"IFERROR((VLOOKUP($A160,DATABASE!$A:$BU,16,0)),\"\")","v":0},{"$f":"IFERROR((VLOOKUP($A160,DATABASE!$A:$BU,17,0)),\"\")","v":0}]
[157,{"$f":"IFERROR((VLOOKUP($A161,DATABASE!$A:$BU,15,0)),\"\")","v":0},{"$f":"IFERROR((VLOOKUP($A161,DATABASE!$A:$BU,16,0)),\"\")","v":0},{"$f":"IFERROR((VLOOKUP($A161,DATABASE!$A:$BU,17,0)),\"\")","v":0}]
[158,{"$f":"IFERROR((VLOOKUP($A162,DATABASE!$A:$BU,15,0)),\"\")","v":0},{"$f":"IFERROR((VLOOKUP($A162,DATABASE!$A:$BU,16,0)),\"\")","v":0},{"$f":"IFERROR((VLOOKUP($A162,DATABASE!$A:$BU,17,0)),\"\")","v":0}]
[159,{"$f":"IFERROR((VLOOKUP($A163,DATABASE!$A:$BU,15,0)),\"\")","v":0},{"$f":"IFERROR((VLOOKUP($A163,DATABASE!$A:$BU,16,0)),\"\")","v":0},{"$f":"IFERROR((VLOOKUP($A163,DATABASE!$A:$BU,17,0)),\"\")","v":0}]
[160,{"$f":"IFERROR((VLOOKUP($A164,DATABASE!$A:$BU,15,0)),\"\")","v":0},{"$f":"IFERROR((VLOOKUP($A164,DATABASE!$A:$BU,16,0)),\"\")","v":0},{"$f":"IFERROR((VLOOKUP($A164,DATABASE!$A:$BU,17,0)),\"\")","v":0}]
[161,{"$f":"IFERROR((VLOOKUP($A165,DATABASE!$A:$BU,15,0)),\"\")","v":0},{"$f":"IFERROR((VLOOKUP($A165,DATABASE!$A:$BU,16,0)),\"\")","v":0},{"$f":"IFERROR((VLOOKUP($A165,DATABASE!$A:$BU,17,0)),\"\")","v":0}]
[162,{"$f":"IFERROR((VLOOKUP($A166,DATABASE!$A:$BU,15,0)),\"\")","v":0},{"$f":"IFERROR((VLOOKUP($A166,DATABASE!$A:$BU,16,0)),\"\")","v":0},{"$f":"IFERROR((VLOOKUP($A166,DATABASE!$A:$BU,17,0)),\"\")","v":0}]
[163,{"$f":"IFERROR((VLOOKUP($A167,DATABASE!$A:$BU,15,0)),\"\")","v":0},{"$f":"IFERROR((VLOOKUP($A167,DATABASE!$A:$BU,16,0)),\"\")","v":0},{"$f":"IFERROR((VLOOKUP($A167,DATABASE!$A:$BU,17,0)),\"\")","v":0}]
[164,{"$f":"IFERROR((VLOOKUP($A168,DATABASE!$A:$BU,15,0)),\"\")","v":0},{"$f":"IFERROR((VLOOKUP($A168,DATABASE!$A:$BU,16,0)),\"\")","v":0},{"$f":"IFERROR((VLOOKUP($A168,DATABASE!$A:$BU,17,0)),\"\")","v":0}]
[165,{"$f":"IFERROR((VLOOKUP($A169,DATABASE!$A:$BU,15,0)),\"\")","v":0},{"$f":"IFERROR((VLOOKUP($A169,DATABASE!$A:$BU,16,0)),\"\")","v":0},{"$f":"IFERROR((VLOOKUP($A169,DATABASE!$A:$BU,17,0)),\"\")","v":0}]
[166,{"$f":"IFERROR((VLOOKUP($A170,DATABASE!$A:$BU,15,0)),\"\")","v":0},{"$f":"IFERROR((VLOOKUP($A170,DATABASE!$A:$BU,16,0)),\"\")","v":0},{"$f":"IFERROR((VLOOKUP($A170,DATABASE!$A:$BU,17,0)),\"\")","v":0}]
[167,{"$f":"IFERROR((VLOOKUP($A171,DATABASE!$A:$BU,15,0)),\"\")","v":0},{"$f":"IFERROR((VLOOKUP($A171,DATABASE!$A:$BU,16,0)),\"\")","v":0},{"$f":"IFERROR((VLOOKUP($A171,DATABASE!$A:$BU,17,0)),\"\")","v":0}]
[168,{"$f":"IFERROR((VLOOKUP($A172,DATABASE!$A:$BU,15,0)),\"\")","v":0},{"$f":"IFERROR((VLOOKUP($A172,DATABASE!$A:$BU,16,0)),\"\")","v":0},{"$f":"IFERROR((VLOOKUP($A172,DATABASE!$A:$BU,17,0)),\"\")","v":0}]
[169,{"$f":"IFERROR((VLOOKUP($A173,DATABASE!$A:$BU,15,0)),\"\")","v":0},{"$f":"IFERROR((VLOOKUP($A173,DATABASE!$A:$BU,16,0)),\"\")","v":0},{"$f":"IFERROR((VLOOKUP($A173,DATABASE!$A:$BU,17,0)),\"\")","v":0}]
[170,{"$f":"IFERROR((VLOOKUP($A174,DATABASE!$A:$BU,15,0)),\"\")","v":0},{"$f":"IFERROR((VLOOKUP($A174,DATABASE!$A:$BU,16,0)),\"\")","v":0},{"$f":"IFERROR((VLOOKUP($A174,DATABASE!$A:$BU,17,0)),\"\")","v":0}]
[171,{"$f":"IFERROR((VLOOKUP($A175,DATABASE!$A:$BU,15,0)),\"\")","v":0},{"$f":"IFERROR((VLOOKUP($A175,DATABASE!$A:$BU,16,0)),\"\")","v":0},{"$f":"IFERROR((VLOOKUP($A175,DATABASE!$A:$BU,17,0)),\"\")","v":0}]
[172,{"$f":"IFERROR((VLOOKUP($A176,DATABASE!$A:$BU,15,0)),\"\")","v":0},{"$f":"IFERROR((VLOOKUP($A176,DATABASE!$A:$BU,16,0)),\"\")","v":0},{"$f":"IFERROR((VLOOKUP($A176,DATABASE!$A:$BU,17,0)),\"\")","v":0}]
[173,{"$f":"IFERROR((VLOOKUP($A177,DATABASE!$A:$BU,15,0)),\"\")","v":0},{"$f":"IFERROR((VLOOKUP($A177,DATABASE!$A:$BU,16,0)),\"\")","v":0},{"$f":"IFERROR((VLOOKUP($A177,DATABASE!$A:$BU,17,0)),\"\")","v":0}]
[174,{"$f":"IFERROR((VLOOKUP($A178,DATABASE!$A:$BU,15,0)),\"\")","v":0},{"$f":"IFERROR((VLOOKUP($A178,DATABASE!$A:$BU,16,0)),\"\")","v":0},{"$f":"IFERROR((VLOOKUP($A178,DATABASE!$A:$BU,17,0)),\"\")","v":0}]
[175,{"$f":"IFERROR((VLOOKUP($A179,DATABASE!$A:$BU,15,0)),\"\")","v":0},{"$f":"IFERROR((VLOOKUP($A179,DATABASE!$A:$BU,16,0)),\"\")","v":0},{"$f":"IFERROR((VLOOKUP($A179,DATABASE!$A:$BU,17,0)),\"\")","v":0}]
[176,{"$f":"IFERROR((VLOOKUP($A180,DATABASE!$A:$BU,15,0)),\"\")","v":0},{"$f":"IFERROR((VLOOKUP($A180,DATABASE!$A:$BU,16,0)),\"\")","v":0},{"$f":"IFERROR((VLOOKUP($A180,DATABASE!$A:$BU,17,0)),\"\")","v":0}]
[177,{"$f":"IFERROR((VLOOKUP($A181,DATABASE!$A:$BU,15,0)),\"\")","v":0},{"$f":"IFERROR((VLOOKUP($A181,DATABASE!$A:$BU,16,0)),\"\")","v":0},{"$f":"IFERROR((VLOOKUP($A181,DATABASE!$A:$BU,17,0)),\"\")","v":0}]
[178,{"$f":"IFERROR((VLOOKUP($A182,DATABASE!$A:$BU,15,0)),\"\")","v":0},{"$f":"IFERROR((VLOOKUP($A182,DATABASE!$A:$BU,16,0)),\"\")","v":0},{"$f":"IFERROR((VLOOKUP($A182,DATABASE!$A:$BU,17,0)),\"\")","v":0}]
[179,{"$f":"IFERROR((VLOOKUP($A183,DATABASE!$A:$BU,15,0)),\"\")","v":0},{"$f":"IFERROR((VLOOKUP($A183,DATABASE!$A:$BU,16,0)),\"\")","v":0},{"$f":"IFERROR((VLOOKUP($A183,DATABASE!$A:$BU,17,0)),\"\")","v":0}]
[180,{"$f":"IFERROR((VLOOKUP($A184,DATABASE!$A:$BU,15,0)),\"\")","v":0},{"$f":"IFERROR((VLOOKUP($A184,DATABASE!$A:$BU,16,0)),\"\")","v":0},{"$f":"IFERROR((VLOOKUP($A184,DATABASE!$A:$BU,17,0)),\"\")","v":0}]
[181,{"$f":"IFERROR((VLOOKUP($A185,DATABASE!$A:$BU,15,0)),\"\")","v":0},{"$f":"IFERROR((VLOOKUP($A185,DATABASE!$A:$BU,16,0)),\"\")","v":0},{"$f":"IFERROR((VLOOKUP($A185,DATABASE!$A:$BU,17,0)),\"\")","v":0}]
[182,{"$f":"IFERROR((VLOOKUP($A186,DATABASE!$A:$BU,15,0)),\"\")","v":0},{"$f":"IFERROR((VLOOKUP($A186,DATABASE!$A:$BU,16,0)),\"\")","v":0},{"$f":"IFERROR((VLOOKUP($A186,DATABASE!$A:$BU,17,0)),\"\")","v":0}]
[183,{"$f":"IFERROR((VLOOKUP($A187,DATABASE!$A:$BU,15,0)),\"\")","v":0},{"$f":"IFERROR((VLOOKUP($A187,DATABASE!$A:$BU,16,0)),\"\")","v":0},{"$f":"IFERROR((VLOOKUP($A187,DATABASE!$A:$BU,17,0)),\"\")","v":0}]
[184,{"$f":"IFERROR((VLOOKUP($A188,DATABASE!$A:$BU,15,0)),\"\")","v":0},{"$f":"IFERROR((VLOOKUP($A188,DATABASE!$A:$BU,16,0)),\"\")","v":0},{"$f":"IFERROR((VLOOKUP($A188,DATABASE!$A:$BU,17,0)),\"\")","v":0}]
[185,{"$f":"IFERROR((VLOOKUP($A189,DATABASE!$A:$BU,15,0)),\"\")","v":0},{"$f":"IFERROR((VLOOKUP($A189,DATABASE!$A:$BU,16,0)),\"\")","v":0},{"$f":"IFERROR((VLOOKUP($A189,DATABASE!$A:$BU,17,0)),\"\")","v":0}]
[186,{"$f":"IFERROR((VLOOKUP($A190,DATABASE!$A:$BU,15,0)),\"\")","v":0},{"$f":"IFERROR((VLOOKUP($A190,DATABASE!$A:$BU,16,0)),\"\")","v":0},{"$f":"IFERROR((VLOOKUP($A190,DATABASE!$A:$BU,17,0)),\"\")","v":0}]
[187,{"$f":"IFERROR((VLOOKUP($A191,DATABASE!$A:$BU,15,0)),\"\")","v":0},{"$f":"IFERROR((VLOOKUP($A191,DATABASE!$A:$BU,16,0)),\"\")","v":0},{"$f":"IFERROR((VLOOKUP($A191,DATABASE!$A:$BU,17,0)),\"\")","v":0}]
[188,{"$f":"IFERROR((VLOOKUP($A192,DATABASE!$A:$BU,15,0)),\"\")","v":0},{"$f":"IFERROR((VLOOKUP($A192,DATABASE!$A:$BU,16,0)),\"\")","v":0},{"$f":"IFERROR((VLOOKUP($A192,DATABASE!$A:$BU,17,0)),\"\")","v":0}]
[189,{"$f":"IFERROR((VLOOKUP($A193,DATABASE!$A:$BU,15,0)),\"\")","v":0},{"$f":"IFERROR((VLOOKUP($A193,DATABASE!$A:$BU,16,0)),\"\")","v":0},{"$f":"IFERROR((VLOOKUP($A193,DATABASE!$A:$BU,17,0)),\"\")","v":0}]
[190,{"$f":"IFERROR((VLOOKUP($A194,DATABASE!$A:$BU,15,0)),\"\")","v":0},{"$f":"IFERROR((VLOOKUP($A194,DATABASE!$A:$BU,16,0)),\"\")","v":0},{"$f":"IFERROR((VLOOKUP($A194,DATABASE!$A:$BU,17,0)),\"\")","v":0}]
[191,{"$f":"IFERROR((VLOOKUP($A195,DATABASE!$A:$BU,15,0)),\"\")","v":0},{"$f":"IFERROR((VLOOKUP($A195,DATABASE!$A:$BU,16,0)),\"\")","v":0},{"$f":"IFERROR((VLOOKUP($A195,DATABASE!$A:$BU,17,0)),\"\")","v":0}]
[192,{"$f":"IFERROR((VLOOKUP($A196,DATABASE!$A:$BU,15,0)),\"\")","v":0},{"$f":"IFERROR((VLOOKUP($A196,DATABASE!$A:$BU,16,0)),\"\")","v":0},{"$f":"IFERROR((VLOOKUP($A196,DATABASE!$A:$BU,17,0)),\"\")","v":0}]
[193,{"$f":"IFERROR((VLOOKUP($A197,DATABASE!$A:$BU,15,0)),\"\")","v":0},{"$f":"IFERROR((VLOOKUP($A197,DATABASE!$A:$BU,16,0)),\"\")","v":0},{"$f":"IFERROR((VLOOKUP($A197,DATABASE!$A:$BU,17,0)),\"\")","v":0}]
[194,{"$f":"IFERROR((VLOOKUP($A198,DATABASE!$A:$BU,15,0)),\"\")","v":0},{"$f":"IFERROR((VLOOKUP($A198,DATABASE!$A:$BU,16,0)),\"\")","v":0},{"$f":"IFERROR((VLOOKUP($A198,DATABASE!$A:$BU,17,0)),\"\")","v":0}]
[195,{"$f":"IFERROR((VLOOKUP($A199,DATABASE!$A:$BU,15,0)),\"\")","v":0},{"$f":"IFERROR((VLOOKUP($A199,DATABASE!$A:$BU,16,0)),\"\")","v":0},{"$f":"IFERROR((VLOOKUP($A199,DATABASE!$A:$BU,17,0)),\"\")","v":0}]
[196,{"$f":"IFERROR((VLOOKUP($A200,DATABASE!$A:$BU,15,0)),\"\")","v":0},{"$f":"IFERROR((VLOOKUP($A200,DATABASE!$A:$BU,16,0)),\"\")","v":0},{"$f":"IFERROR((VLOOKUP($A200,DATABASE!$A:$BU,17,0)),\"\")","v":0}]
[197,{"$f":"IFERROR((VLOOKUP($A201,DATABASE!$A:$BU,15,0)),\"\")","v":0},{"$f":"IFERROR((VLOOKUP($A201,DATABASE!$A:$BU,16,0)),\"\")","v":0},{"$f":"IFERROR((VLOOKUP($A201,DATABASE!$A:$BU,17,0)),\"\")","v":0}]
[198,{"$f":"IFERROR((VLOOKUP($A202,DATABASE!$A:$BU,15,0)),\"\")","v":0},{"$f":"IFERROR((VLOOKUP($A202,DATABASE!$A:$BU,16,0)),\"\")","v":0},{"$f":"IFERROR((VLOOKUP($A202,DATABASE!$A:$BU,17,0)),\"\")","v":0}]
[199,{"$f":"IFERROR((VLOOKUP($A203,DATABASE!$A:$BU,15,0)),\"\")","v":0},{"$f":"IFERROR((VLOOKUP($A203,DATABASE!$A:$BU,16,0)),\"\")","v":0},{"$f":"IFERROR((VLOOKUP($A203,DATABASE!$A:$BU,17,0)),\"\")","v":0}]
[200,{"$f":"IFERROR((VLOOKUP($A204,DATABASE!$A:$BU,15,0)),\"\")","v":0},{"$f":"IFERROR((VLOOKUP($A204,DATABASE!$A:$BU,16,0)),\"\")","v":0},{"$f":"IFERROR((VLOOKUP($A204,DATABASE!$A:$BU,17,0)),\"\")","v":0}]
[201,{"$f":"IFERROR((VLOOKUP($A205,DATABASE!$A:$BU,15,0)),\"\")","v":0},{"$f":"IFERROR((VLOOKUP($A205,DATABASE!$A:$BU,16,0)),\"\")","v":0},{"$f":"IFERROR((VLOOKUP($A205,DATABASE!$A:$BU,17,0)),\"\")","v":0}]
[202,{"$f":"IFERROR((VLOOKUP($A206,DATABASE!$A:$BU,15,0)),\"\")","v":0},{"$f":"IFERROR((VLOOKUP($A206,DATABASE!$A:$BU,16,0)),\"\")","v":0},{"$f":"IFERROR((VLOOKUP($A206,DATABASE!$A:$BU,17,0)),\"\")","v":0}]
[203,{"$f":"IFERROR((VLOOKUP($A207,DATABASE!$A:$BU,15,0)),\"\")","v":0},{"$f":"IFERROR((VLOOKUP($A207,DATABASE!$A:$BU,16,0)),\"\")","v":0},{"$f":"IFERROR((VLOOKUP($A207,DATABASE!$A:$BU,17,0)),\"\")","v":0}]
[204,{"$f":"IFERROR((VLOOKUP($A208,DATABASE!$A:$BU,15,0)),\"\")","v":0},{"$f":"IFERROR((VLOOKUP($A208,DATABASE!$A:$BU,16,0)),\"\")","v":0},{"$f":"IFERROR((VLOOKUP($A208,DATABASE!$A:$BU,17,0)),\"\")","v":0}]
[205,{"$f":"IFERROR((VLOOKUP($A209,DATABASE!$A:$BU,15,0)),\"\")","v":0},{"$f":"IFERROR((VLOOKUP($A209,DATABASE!$A:$BU,16,0)),\"\")","v":0},{"$f":"IFERROR((VLOOKUP($A209,DATABASE!$A:$BU,17,0)),\"\")","v":0}]
[206,{"$f":"IFERROR((VLOOKUP($A210,DATABASE!$A:$BU,15,0)),\"\")","v":0},{"$f":"IFERROR((VLOOKUP($A210,DATABASE!$A:$BU,16,0)),\"\")","v":0},{"$f":"IFERROR((VLOOKUP($A210,DATABASE!$A:$BU,17,0)),\"\")","v":0}]
[207,{"$f":"IFERROR((VLOOKUP($A211,DATABASE!$A:$BU,15,0)),\"\")","v":0},{"$f":"IFERROR((VLOOKUP($A211,DATABASE!$A:$BU,16,0)),\"\")","v":0},{"$f":"IFERROR((VLOOKUP($A211,DATABASE!$A:$BU,17,0)),\"\")","v":0}]
[208,{"$f":"IFERROR((VLOOKUP($A212,DATABASE!$A:$BU,15,0)),\"\")","v":0},{"$f":"IFERROR((VLOOKUP($A212,DATABASE!$A:$BU,16,0)),\"\")","v":0},{"$f":"IFERROR((VLOOKUP($A212,DATABASE!$A:$BU,17,0)),\"\")","v":0}]
[209,{"$f":"IFERROR((VLOOKUP($A213,DATABASE!$A:$BU,15,0)),\"\")","v":0},{"$f":"IFERROR((VLOOKUP($A213,DATABASE!$A:$BU,16,0)),\"\")","v":0},{"$f":"IFERROR((VLOOKUP($A213,DATABASE!$A:$BU,17,0)),\"\")","v":0}]
[210,{"$f":"IFERROR((VLOOKUP($A214,DATABASE!$A:$BU,15,0)),\"\")","v":0},{"$f":"IFERROR((VLOOKUP($A214,DATABASE!$A:$BU,16,0)),\"\")","v":0},{"$f":"IFERROR((VLOOKUP($A214,DATABASE!$A:$BU,17,0)),\"\")","v":0}]
[211,{"$f":"IFERROR((VLOOKUP($A215,DATABASE!$A:$BU,15,0)),\"\")","v":0},{"$f":"IFERROR((VLOOKUP($A215,DATABASE!$A:$BU,16,0)),\"\")","v":0},{"$f":"IFERROR((VLOOKUP($A215,DATABASE!$A:$BU,17,0)),\"\")","v":0}]
[212,{"$f":"IFERROR((VLOOKUP($A216,DATABASE!$A:$BU,15,0)),\"\")","v":0},{"$f":"IFERROR((VLOOKUP($A216,DATABASE!$A:$BU,16,0)),\"\")","v":0},{"$f":"IFERROR((VLOOKUP($A216,DATABASE!$A:$BU,17,0)),\"\")","v":0}]
[213,{"$f":"IFERROR((VLOOKUP($A217,DATABASE!$A:$BU,15,0)),\"\")","v":0},{"$f":"IFERROR((VLOOKUP($A217,DATABASE!$A:$BU,16,0)),\"\")","v":0},{"$f":"IFERROR((VLOOKUP($A217,DATABASE!$A:$BU,17,0)),\"\")","v":0}]
[214,{"$f":"IFERROR((VLOOKUP($A218,DATABASE!$A:$BU,15,0)),\"\")","v":0},{"$f":"IFERROR((VLOOKUP($A218,DATABASE!$A:$BU,16,0)),\"\")","v":0},{"$f":"IFERROR((VLOOKUP($A218,DATABASE!$A:$BU,17,0)),\"\")","v":0}]
[215,{"$f":"IFERROR((VLOOKUP($A219,DATABASE!$A:$BU,15,0)),\"\")","v":0},{"$f":"IFERROR((VLOOKUP($A219,DATABASE!$A:$BU,16,0)),\"\")","v":0},{"$f":"IFERROR((VLOOKUP($A219,DATABASE!$A:$BU,17,0)),\"\")","v":0}]
[216,{"$f":"IFERROR((VLOOKUP($A220,DATABASE!$A:$BU,15,0)),\"\")","v":0},{"$f":"IFERROR((VLOOKUP($A220,DATABASE!$A:$BU,16,0)),\"\")","v":0},{"$f":"IFERROR((VLOOKUP($A220,DATABASE!$A:$BU,17,0)),\"\")","v":0}]
[217,{"$f":"IFERROR((VLOOKUP($A221,DATABASE!$A:$BU,15,0)),\"\")","v":0},{"$f":"IFERROR((VLOOKUP($A221,DATABASE!$A:$BU,16,0)),\"\")","v":0},{"$f":"IFERROR((VLOOKUP($A221,DATABASE!$A:$BU,17,0)),\"\")","v":0}]
[218,{"$f":"IFERROR((VLOOKUP($A222,DATABASE!$A:$BU,15,0)),\"\")","v":0},{"$f":"IFERROR((VLOOKUP($A222,DATABASE!$A:$BU,16,0)),\"\")","v":0},{"$f":"IFERROR((VLOOKUP($A222,DATABASE!$A:$BU,17,0)),\"\")","v":0}]
[219,{"$f":"IFERROR((VLOOKUP($A223,DATABASE!$A:$BU,15,0)),\"\")","v":0},{"$f":"IFERROR((VLOOKUP($A223,DATABASE!$A:$BU,16,0)),\"\")","v":0},{"$f":"IFERROR((VLOOKUP($A223,DATABASE!$A:$BU,17,0)),\"\")","v":0}]
[220,{"$f":"IFERROR((VLOOKUP($A224,DATABASE!$A:$BU,15,0)),\"\")","v":0},{"$f":"IFERROR((VLOOKUP($A224,DATABASE!$A:$BU,16,0)),\"\")","v":0},{"$f":"IFERROR((VLOOKUP($A224,DATABASE!$A:$BU,17,0)),\"\")","v":0}]
[221,{"$f":"IFERROR((VLOOKUP($A225,DATABASE!$A:$BU,15,0)),\"\")","v":0},{"$f":"IFERROR((VLOOKUP($A225,DATABASE!$A:$BU,16,0)),\"\")","v":0},{"$f":"IFERROR((VLOOKUP($A225,DATABASE!$A:$BU,17,0)),\"\")","v":0}]
[222,{"$f":"IFERROR((VLOOKUP($A226,DATABASE!$A:$BU,15,0)),\"\")","v":0},{"$f":"IFERROR((VLOOKUP($A226,DATABASE!$A:$BU,16,0)),\"\")","v":0},{"$f":"IFERROR((VLOOKUP($A226,DATABASE!$A:$BU,17,0)),\"\")","v":0}]
[223,{"$f":"IFERROR((VLOOKUP($A227,DATABASE!$A:$BU,15,0)),\"\")","v":0},{"$f":"IFERROR((VLOOKUP($A227,DATABASE!$A:$BU,16,0)),\"\")","v":0},{"$f":"IFERROR((VLOOKUP($A227,DATABASE!$A:$BU,17,0)),\"\")","v":0}]
[224,{"$f":"IFERROR((VLOOKUP($A228,DATABASE!$A:$BU,15,0)),\"\")","v":0},{"$f":"IFERROR((VLOOKUP($A228,DATABASE!$A:$BU,16,0)),\"\")","v":0},{"$f":"IFERROR((VLOOKUP($A228,DATABASE!$A:$BU,17,0)),\"\")","v":0}]
[225,{"$f":"IFERROR((VLOOKUP($A229,DATABASE!$A:$BU,15,0)),\"\")","v":0},{"$f":"IFERROR((VLOOKUP($A229,DATABASE!$A:$BU,16,0)),\"\")","v":0},{"$f":"IFERROR((VLOOKUP($A229,DATABASE!$A:$BU,17,0)),\"\")","v":0}]
[226,{"$f":"IFERROR((VLOOKUP($A230,DATABASE!$A:$BU,15,0)),\"\")","v":0},{"$f":"IFERROR((VLOOKUP($A230,DATABASE!$A:$BU,16,0)),\"\")","v":0},{"$f":"IFERROR((VLOOKUP($A230,DATABASE!$A:$BU,17,0)),\"\")","v":0}]
[227,{"$f":"IFERROR((VLOOKUP($A231,DATABASE!$A:$BU,15,0)),\"\")","v":0},{"$f":"IFERROR((VLOOKUP($A231,DATABASE!$A:$BU,16,0)),\"\")","v":0},{"$f":"IFERROR((VLOOKUP($A231,DATABASE!$A:$BU,17,0)),\"\")","v":0}]
[228,{"$f":"IFERROR((VLOOKUP($A232,DATABASE!$A:$BU,15,0)),\"\")","v":0},{"$f":"IFERROR((VLOOKUP($A232,DATABASE!$A:$BU,16,0)),\"\")","v":0},{"$f":"IFERROR((VLOOKUP($A232,DATABASE!$A:$BU,17,0)),\"\")","v":0}]
[229,{"$f":"IFERROR((VLOOKUP($A233,DATABASE!$A:$BU,15,0)),\"\")","v":0},{"$f":"IFERROR((VLOOKUP($A233,DATABASE!$A:$BU,16,0)),\"\")","v":0},{"$f":"IFERROR((VLOOKUP($A233,DATABASE!$A:$BU,17,0)),\"\")","v":0}]
[230,{"$f":"IFERROR((VLOOKUP($A234,DATABASE!$A:$BU,15,0)),\"\")","v":0},{"$f":"IFERROR((VLOOKUP($A234,DATABASE!$A:$BU,16,0)),\"\")","v":0},{"$f":"IFERROR((VLOOKUP($A234,DATABASE!$A:$BU,17,0)),\"\")","v":0}]
[231,{"$f":"IFERROR((VLOOKUP($A235,DATABASE!$A:$BU,15,0)),\"\")","v":0},{"$f":"IFERROR((VLOOKUP($A235,DATABASE!$A:$BU,16,0)),\"\")","v":0},{"$f":"IFERROR((VLOOKUP($A235,DATABASE!$A:$BU,17,0)),\"\")","v":0}]
[232,{"$f":"IFERROR((VLOOKUP($A236,DATABASE!$A:$BU,15,0)),\"\")","v":0},{"$f":"IFERROR((VLOOKUP($A236,DATABASE!$A:$BU,16,0)),\"\")","v":0},{"$f":"IFERROR((VLOOKUP($A236,DATABASE!$A:$BU,17,0)),\"\")","v":0}]
[233,{"$f":"IFERROR((VLOOKUP($A237,DATABASE!$A:$BU,15,0)),\"\")","v":0},{"$f":"IFERROR((VLOOKUP($A237,DATABASE!$A:$BU,16,0)),\"\")","v":0},{"$f":"IFERROR((VLOOKUP($A237,DATABASE!$A:$BU,17,0)),\"\")","v":0}]
[234,{"$f":"IFERROR((VLOOKUP($A238,DATABASE!$A:$BU,15,0)),\"\")","v":0},{"$f":"IFERROR((VLOOKUP($A238,DATABASE!$A:$BU,16,0)),\"\")","v":0},{"$f":"IFERROR((VLOOKUP($A238,DATABASE!$A:$BU,17,0)),\"\")","v":0}]
[235,{"$f":"IFERROR((VLOOKUP($A239,DATABASE!$A:$BU,15,0)),\"\")","v":0},{"$f":"IFERROR((VLOOKUP($A239,DATABASE!$A:$BU,16,0)),\"\")","v":0},{"$f":"IFERROR((VLOOKUP($A239,DATABASE!$A:$BU,17,0)),\"\")","v":0}]
[236,{"$f":"IFERROR((VLOOKUP($A240,DATABASE!$A:$BU,15,0)),\"\")","v":0},{"$f":"IFERROR((VLOOKUP($A240,DATABASE!$A:$BU,16,0)),\"\")","v":0},{"$f":"IFERROR((VLOOKUP($A240,DATABASE!$A:$BU,17,0)),\"\")","v":0}]
[237,{"$f":"IFERROR((VLOOKUP($A241,DATABASE!$A:$BU,15,0)),\"\")","v":0},{"$f":"IFERROR((VLOOKUP($A241,DATABASE!$A:$BU,16,0)),\"\")","v":0},{"$f":"IFERROR((VLOOKUP($A241,DATABASE!$A:$BU,17,0)),\"\")","v":0}]
[238,{"$f":"IFERROR((VLOOKUP($A242,DATABASE!$A:$BU,15,0)),\"\")","v":0},{"$f":"IFERROR((VLOOKUP($A242,DATABASE!$A:$BU,16,0)),\"\")","v":0},{"$f":"IFERROR((VLOOKUP($A242,DATABASE!$A:$BU,17,0)),\"\")","v":0}]
[239,{"$f":"IFERROR((VLOOKUP($A243,DATABASE!$A:$BU,15,0)),\"\")","v":0},{"$f":"IFERROR((VLOOKUP($A243,DATABASE!$A:$BU,16,0)),\"\")","v":0},{"$f":"IFERROR((VLOOKUP($A243,DATABASE!$A:$BU,17,0)),\"\")","v":0}]
[240,{"$f":"IFERROR((VLOOKUP($A244,DATABASE!$A:$BU,15,0)),\"\")","v":0},{"$f":"IFERROR((VLOOKUP($A244,DATABASE!$A:$BU,16,0)),\"\")","v":0},{"$f":"IFERROR((VLOOKUP($A244,DATABASE!$A:$BU,17,0)),\"\")","v":0}]
[241,{"$f":"IFERROR((VLOOKUP($A245,DATABASE!$A:$BU,15,0)),\"\")","v":0},{"$f":"IFERROR((VLOOKUP($A245,DATABASE!$A:$BU,16,0)),\"\")","v":0},{"$f":"IFERROR((VLOOKUP($A245,DATABASE!$A:$BU,17,0)),\"\")","v":0}]
[242,{"$f":"IFERROR((VLOOKUP($A246,DATABASE!$A:$BU,15,0)),\"\")","v":0},{"$f":"IFERROR((VLOOKUP($A246,DATABASE!$A:$BU,16,0)),\"\")","v":0},{"$f":"IFERROR((VLOOKUP($A246,DATABASE!$A:$BU,17,0)),\"\")","v":0}]
[243,{"$f":"IFERROR((VLOOKUP($A247,DATABASE!$A:$BU,15,0)),\"\")","v":0},{"$f":"IFERROR((VLOOKUP($A247,DATABASE!$A:$BU,16,0)),\"\")","v":0},{"$f":"IFERROR((VLOOKUP($A247,DATABASE!$A:$BU,17,0)),\"\")","v":0}]
[244,{"$f":"IFERROR((VLOOKUP($A248,DATABASE!$A:$BU,15,0)),\"\")","v":0},{"$f":"IFERROR((VLOOKUP($A248,DATABASE!$A:$BU,16,0)),\"\")","v":0},{"$f":"IFERROR((VLOOKUP($A248,DATABASE!$A:$BU,17,0)),\"\")","v":0}]
[245,{"$f":"IFERROR((VLOOKUP($A249,DATABASE!$A:$BU,15,0)),\"\")","v":0},{"$f":"IFERROR((VLOOKUP($A249,DATABASE!$A:$BU,16,0)),\"\")","v":0},{"$f":"IFERROR((VLOOKUP($A249,DATABASE!$A:$BU,17,0)),\"\")","v":0}]
[246,{"$f":"IFERROR((VLOOKUP($A250,DATABASE!$A:$BU,15,0)),\"\")","v":0},{"$f":"IFERROR((VLOOKUP($A250,DATABASE!$A:$BU,16,0)),\"\")","v":0},{"$f":"IFERROR((VLOOKUP($A250,DATABASE!$A:$BU,17,0)),\"\")","v":0}]
[247,{"$f":"IFERROR((VLOOKUP($A251,DATABASE!$A:$BU,15,0)),\"\")","v":0},{"$f":"IFERROR((VLOOKUP($A251,DATABASE!$A:$BU,16,0)),\"\")","v":0},{"$f":"IFERROR((VLOOKUP($A251,DATABASE!$A:$BU,17,0)),\"\")","v":0}]
[248,{"$f":"IFERROR((VLOOKUP($A252,DATABASE!$A:$BU,15,0)),\"\")","v":0},{"$f":"IFERROR((VLOOKUP($A252,DATABASE!$A:$BU,16,0)),\"\")","v":0},{"$f":"IFERROR((VLOOKUP($A252,DATABASE!$A:$BU,17,0)),\"\")","v":0}]
[249,{"$f":"IFERROR((VLOOKUP($A253,DATABASE!$A:$BU,15,0)),\"\")","v":0},{"$f":"IFERROR((VLOOKUP($A253,DATABASE!$A:$BU,16,0)),\"\")","v":0},{"$f":"IFERROR((VLOOKUP($A253,DATABASE!$A:$BU,17,0)),\"\")","v":0}]
[250,{"$f":"IFERROR((VLOOKUP($A254,DATABASE!$A:$BU,15,0)),\"\")","v":0},{"$f":"IFERROR((VLOOKUP($A254,DATABASE!$A:$BU,16,0)),\"\")","v":0},{"$f":"IFERROR((VLOOKUP($A254,DATABASE!$A:$BU,17,0)),\"\")","v":0}]
[251,{"$f":"IFERROR((VLOOKUP($A255,DATABASE!$A:$BU,15,0)),\"\")","v":0},{"$f":"IFERROR((VLOOKUP($A255,DATABASE!$A:$BU,16,0)),\"\")","v":0},{"$f":"IFERROR((VLOOKUP($A255,DATABASE!$A:$BU,17,0)),\"\")","v":0}]
[252,{"$f":"IFERROR((VLOOKUP($A256,DATABASE!$A:$BU,15,0)),\"\")","v":0},{"$f":"IFERROR((VLOOKUP($A256,DATABASE!$A:$BU,16,0)),\"\")","v":0},{"$f":"IFERROR((VLOOKUP($A256,DATABASE!$A:$BU,17,0)),\"\")","v":0}]
[253,{"$f":"IFERROR((VLOOKUP($A257,DATABASE!$A:$BU,15,0)),\"\")","v":0},{"$f":"IFERROR((VLOOKUP($A257,DATABASE!$A:$BU,16,0)),\"\")","v":0},{"$f":"IFERROR((VLOOKUP($A257,DATABASE!$A:$BU,17,0)),\"\")","v":0}]
[254,{"$f":"IFERROR((VLOOKUP($A258,DATABASE!$A:$BU,15,0)),\"\")","v":0},{"$f":"IFERROR((VLOOKUP($A258,DATABASE!$A:$BU,16,0)),\"\")","v":0},{"$f":"IFERROR((VLOOKUP($A258,DATABASE!$A:$BU,17,0)),\"\")","v":0}]
[255,{"$f":"IFERROR((VLOOKUP($A259,DATABASE!$A:$BU,15,0)),\"\")","v":0},{"$f":"IFERROR((VLOOKUP($A259,DATABASE!$A:$BU,16,0)),\"\")","v":0},{"$f":"IFERROR((VLOOKUP($A259,DATABASE!$A:$BU,17,0)),\"\")","v":0}]
[256,{"$f":"IFERROR((VLOOKUP($A260,DATABASE!$A:$BU,15,0)),\"\")","v":0},{"$f":"IFERROR((VLOOKUP($A260,DATABASE!$A:$BU,16,0)),\"\")","v":0},{"$f":"IFERROR((VLOOKUP($A260,DATABASE!$A:$BU,17,0)),\"\")","v":0}]
[257,{"$f":"IFERROR((VLOOKUP($A261,DATABASE!$A:$BU,15,0)),\"\")","v":0},{"$f":"IFERROR((VLOOKUP($A261,DATABASE!$A:$BU,16,0)),\"\")","v":0},{"$f":"IFERROR((VLOOKUP($A261,DATABASE!$A:$BU,17,0)),\"\")","v":0}]
[258,{"$f":"IFERROR((VLOOKUP($A262,DATABASE!$A:$BU,15,0)),\"\")","v":0},{"$f":"IFERROR((VLOOKUP($A262,DATABASE!$A:$BU,16,0)),\"\")","v":0},{"$f":"IFERROR((VLOOKUP($A262,DATABASE!$A:$BU,17,0)),\"\")","v":0}]
[259,{"$f":"IFERROR((VLOOKUP($A263,DATABASE!$A:$BU,15,0)),\"\")","v":0},{"$f":"IFERROR((VLOOKUP($A263,DATABASE!$A:$BU,16,0)),\"\")","v":0},{"$f":"IFERROR((VLOOKUP($A263,DATABASE!$A:$BU,17,0)),\"\")","v":0}]
[260,{"$f":"IFERROR((VLOOKUP($A264,DATABASE!$A:$BU,15,0)),\"\")","v":0},{"$f":"IFERROR((VLOOKUP($A264,DATABASE!$A:$BU,16,0)),\"\")","v":0},{"$f":"IFERROR((VLOOKUP($A264,DATABASE!$A:$BU,17,0)),\"\")","v":0}]
[261,{"$f":"IFERROR((VLOOKUP($A265,DATABASE!$A:$BU,15,0)),\"\")","v":0},{"$f":"IFERROR((VLOOKUP($A265,DATABASE!$A:$BU,16,0)),\"\")","v":0},{"$f":"IFERROR((VLOOKUP($A265,DATABASE!$A:$BU,17,0)),\"\")","v":0}]
[262,{"$f":"IFERROR((VLOOKUP($A266,DATABASE!$A:$BU,15,0)),\"\")","v":0},{"$f":"IFERROR((VLOOKUP($A266,DATABASE!$A:$BU,16,0)),\"\")","v":0},{"$f":"IFERROR((VLOOKUP($A266,DATABASE!$A:$BU,17,0)),\"\")","v":0}]
[263,{"$f":"IFERROR((VLOOKUP($A267,DATABASE!$A:$BU,15,0)),\"\")","v":0},{"$f":"IFERROR((VLOOKUP($A267,DATABASE!$A:$BU,16,0)),\"\")","v":0},{"$f":"IFERROR((VLOOKUP($A267,DATABASE!$A:$BU,17,0)),\"\")","v":0}]
[264,{"$f":"IFERROR((VLOOKUP($A268,DATABASE!$A:$BU,15,0)),\"\")","v":0},{"$f":"IFERROR((VLOOKUP($A268,DATABASE!$A:$BU,16,0)),\"\")","v":0},{"$f":"IFERROR((VLOOKUP($A268,DATABASE!$A:$BU,17,0)),\"\")","v":0}]
[265,{"$f":"IFERROR((VLOOKUP($A269,DATABASE!$A:$BU,15,0)),\"\")","v":0},{"$f":"IFERROR((VLOOKUP($A269,DATABASE!$A:$BU,16,0)),\"\")","v":0},{"$f":"IFERROR((VLOOKUP($A269,DATABASE!$A:$BU,17,0)),\"\")","v":0}]
[266,{"$f":"IFERROR((VLOOKUP($A270,DATABASE!$A:$BU,15,0)),\"\")","v":0},{"$f":"IFERROR((VLOOKUP($A270,DATABASE!$A:$BU,16,0)),\"\")","v":0},{"$f":"IFERROR((VLOOKUP($A270,DATABASE!$A:$BU,17,0)),\"\")","v":0}]
[267,{"$f":"IFERROR((VLOOKUP($A271,DATABASE!$A:$BU,15,0)),\"\")","v":0},{"$f":"IFERROR((VLOOKUP($A271,DATABASE!$A:$BU,16,0)),\"\")","v":0},{"$f":"IFERROR((VLOOKUP($A271,DATABASE!$A:$BU,17,0)),\"\")","v":0}]
[268,{"$f":"IFERROR((VLOOKUP($A272,DATABASE!$A:$BU,15,0)),\"\")","v":0},{"$f":"IFERROR((VLOOKUP($A272,DATABASE!$A:$BU,16,0)),\"\")","v":0},{"$f":"IFERROR((VLOOKUP($A272,DATABASE!$A:$BU,17,0)),\"\")","v":0}]
[269,{"$f":"IFERROR((VLOOKUP($A273,DATABASE!$A:$BU,15,0)),\"\")","v":0},{"$f":"IFERROR((VLOOKUP($A273,DATABASE!$A:$BU,16,0)),\"\")","v":0},{"$f":"IFERROR((VLOOKUP($A273,DATABASE!$A:$BU,17,0)),\"\")","v":0}]
[270,{"$f":"IFERROR((VLOOKUP($A274,DATABASE!$A:$BU,15,0)),\"\")","v":0},{"$f":"IFERROR((VLOOKUP($A274,DATABASE!$A:$BU,16,0)),\"\")","v":0},{"$f":"IFERROR((VLOOKUP($A274,DATABASE!$A:$BU,17,0)),\"\")","v":0}]
[271,{"$f":"IFERROR((VLOOKUP($A275,DATABASE!$A:$BU,15,0)),\"\")","v":0},{"$f":"IFERROR((VLOOKUP($A275,DATABASE!$A:$BU,16,0)),\"\")","v":0},{"$f":"IFERROR((VLOOKUP($A275,DATABASE!$A:$BU,17,0)),\"\")","v":0}]
[272,{"$f":"IFERROR((VLOOKUP($A276,DATABASE!$A:$BU,15,0)),\"\")","v":0},{"$f":"IFERROR((VLOOKUP($A276,DATABASE!$A:$BU,16,0)),\"\")","v":0},{"$f":"IFERROR((VLOOKUP($A276,DATABASE!$A:$BU,17,0)),\"\")","v":0}]
[273,{"$f":"IFERROR((VLOOKUP($A277,DATABASE!$A:$BU,15,0)),\"\")","v":0},{"$f":"IFERROR((VLOOKUP($A277,DATABASE!$A:$BU,16,0)),\"\")","v":0},{"$f":"IFERROR((VLOOKUP($A277,DATABASE!$A:$BU,17,0)),\"\")","v":0}]
[274,{"$f":"IFERROR((VLOOKUP($A278,DATABASE!$A:$BU,15,0)),\"\")","v":0},{"$f":"IFERROR((VLOOKUP($A278,DATABASE!$A:$BU,16,0)),\"\")","v":0},{"$f":"IFERROR((VLOOKUP($A278,DATABASE!$A:$BU,17,0)),\"\")","v":0}]
[275,{"$f":"IFERROR((VLOOKUP($A279,DATABASE!$A:$BU,15,0)),\"\")","v":0},{"$f":"IFERROR((VLOOKUP($A279,DATABASE!$A:$BU,16,0)),\"\")","v":0},{"$f":"IFERROR((VLOOKUP($A279,DATABASE!$A:$BU,17,0)),\"\")","v":0}]
[276,{"$f":"IFERROR((VLOOKUP($A280,DATABASE!$A:$BU,15,0)),\"\")","v":0},{"$f":"IFERROR((VLOOKUP($A280,DATABASE!$A:$BU,16,0)),\"\")","v":0},{"$f":"IFERROR((VLOOKUP($A280,DATABASE!$A:$BU,17,0)),\"\")","v":0}]
[277,{"$f":"IFERROR((VLOOKUP($A281,DATABASE!$A:$BU,15,0)),\"\")","v":0},{"$f":"IFERROR((VLOOKUP($A281,DATABASE!$A:$BU,16,0)),\"\")","v":0},{"$f":"IFERROR((VLOOKUP($A281,DATABASE!$A:$BU,17,0)),\"\")","v":0}]
[278,{"$f":"IFERROR((VLOOKUP($A282,DATABASE!$A:$BU,15,0)),\"\")","v":0},{"$f":"IFERROR((VLOOKUP($A282,DATABASE!$A:$BU,16,0)),\"\")","v":0},{"$f":"IFERROR((VLOOKUP($A282,DATABASE!$A:$BU,17,0)),\"\")","v":0}]
[279,{"$f":"IFERROR((VLOOKUP($A283,DATABASE!$A:$BU,15,0)),\"\")","v":0},{"$f":"IFERROR((VLOOKUP($A283,DATABASE!$A:$BU,16,0)),\"\")","v":0},{"$f":"IFERROR((VLOOKUP($A283,DATABASE!$A:$BU,17,0)),\"\")","v":0}]
[280,{"$f":"IFERROR((VLOOKUP($A284,DATABASE!$A:$BU,15,0)),\"\")","v":0},{"$f":"IFERROR((VLOOKUP($A284,DATABASE!$A:$BU,16,0)),\"\")","v":0},{"$f":"IFERROR((VLOOKUP($A284,DATABASE!$A:$BU,17,0)),\"\")","v":0}]
[281,{"$f":"IFERROR((VLOOKUP($A285,DATABASE!$A:$BU,15,0)),\"\")","v":0},{"$f":"IFERROR((VLOOKUP($A285,DATABASE!$A:$BU,16,0)),\"\")","v":0},{"$f":"IFERROR((VLOOKUP($A285,DATABASE!$A:$BU,17,0)),\"\")","v":0}]
[282,{"$f":"IFERROR((VLOOKUP($A286,DATABASE!$A:$BU,15,0)),\"\")","v":0},{"$f":"IFERROR((VLOOKUP($A286,DATABASE!$A:$BU,16,0)),\"\")","v":0},{"$f":"IFERROR((VLOOKUP($A286,DATABASE!$A:$BU,17,0)),\"\")","v":0}]
[283,{"$f":"IFERROR((VLOOKUP($A287,DATABASE!$A:$BU,15,0)),\"\")","v":0},{"$f":"IFERROR((VLOOKUP($A287,DATABASE!$A:$BU,16,0)),\"\")","v":0},{"$f":"IFERROR((VLOOKUP($A287,DATABASE!$A:$BU,17,0)),\"\")","v":0}]
[284,{"$f":"IFERROR((VLOOKUP($A288,DATABASE!$A:$BU,15,0)),\"\")","v":0},{"$f":"IFERROR((VLOOKUP($A288,DATABASE!$A:$BU,16,0)),\"\")","v":0},{"$f":"IFERROR((VLOOKUP($A288,DATABASE!$A:$BU,17,0)),\"\")","v":0}]
[285,{"$f":"IFERROR((VLOOKUP($A289,DATABASE!$A:$BU,15,0)),\"\")","v":0},{"$f":"IFERROR((VLOOKUP($A289,DATABASE!$A:$BU,16,0)),\"\")","v":0},{"$f":"IFERROR((VLOOKUP($A289,DATABASE!$A:$BU,17,0)),\"\")","v":0}]
[286,{"$f":"IFERROR((VLOOKUP($A290,DATABASE!$A:$BU,15,0)),\"\")","v":0},{"$f":"IFERROR((VLOOKUP($A290,DATABASE!$A:$BU,16,0)),\"\")","v":0},{"$f":"IFERROR((VLOOKUP($A290,DATABASE!$A:$BU,17,0)),\"\")","v":0}]
[287,{"$f":"IFERROR((VLOOKUP($A291,DATABASE!$A:$BU,15,0)),\"\")","v":0},{"$f":"IFERROR((VLOOKUP($A291,DATABASE!$A:$BU,16,0)),\"\")","v":0},{"$f":"IFERROR((VLOOKUP($A291,DATABASE!$A:$BU,17,0)),\"\")","v":0}]
[288,{"$f":"IFERROR((VLOOKUP($A292,DATABASE!$A:$BU,15,0)),\"\")","v":0},{"$f":"IFERROR((VLOOKUP($A292,DATABASE!$A:$BU,16,0)),\"\")","v":0},{"$f":"IFERROR((VLOOKUP($A292,DATABASE!$A:$BU,17,0)),\"\")","v":0}]
[289,{"$f":"IFERROR((VLOOKUP($A293,DATABASE!$A:$BU,15,0)),\"\")","v":0},{"$f":"IFERROR((VLOOKUP($A293,DATABASE!$A:$BU,16,0)),\"\")","v":0},{"$f":"IFERROR((VLOOKUP($A293,DATABASE!$A:$BU,17,0)),\"\")","v":0}]
[290,{"$f":"IFERROR((VLOOKUP($A294,DATABASE!$A:$BU,15,0)),\"\")","v":0},{"$f":"IFERROR((VLOOKUP($A294,DATABASE!$A:$BU,16,0)),\"\")","v":0},{"$f":"IFERROR((VLOOKUP($A294,DATABASE!$A:$BU,17,0)),\"\")","v":0}]
[291,{"$f":"IFERROR((VLOOKUP($A295,DATABASE!$A:$BU,15,0)),\"\")","v":0},{"$f":"IFERROR((VLOOKUP($A295,DATABASE!$A:$BU,16,0)),\"\")","v":0},{"$f":"IFERROR((VLOOKUP($A295,DATABASE!$A:$BU,17,0)),\"\")","v":0}]
[292,{"$f":"IFERROR((VLOOKUP($A296,DATABASE!$A:$BU,15,0)),\"\")","v":0},{"$f":"IFERROR((VLOOKUP($A296,DATABASE!$A:$BU,16,0)),\"\")","v":0},{"$f":"IFERROR((VLOOKUP($A296,DATABASE!$A:$BU,17,0)),\"\")","v":0}]
[293,{"$f":"IFERROR((VLOOKUP($A297,DATABASE!$A:$BU,15,0)),\"\")","v":0},{"$f":"IFERROR((VLOOKUP($A297,DATABASE!$A:$BU,16,0)),\"\")","v":0},{"$f":"IFERROR((VLOOKUP($A297,DATABASE!$A:$BU,17,0)),\"\")","v":0}]
[294,{"$f":"IFERROR((VLOOKUP($A298,DATABASE!$A:$BU,15,0)),\"\")","v":0},{"$f":"IFERROR((VLOOKUP($A298,DATABASE!$A:$BU,16,0)),\"\")","v":0},{"$f":"IFERROR((VLOOKUP($A298,DATABASE!$A:$BU,17,0)),\"\")","v":0}]
[295,{"$f":"IFERROR((VLOOKUP($A299,DATABASE!$A:$BU,15,0)),\"\")","v":0},{"$f":"IFERROR((VLOOKUP($A299,DATABASE!$A:$BU,16,0)),\"\")","v":0},{"$f":"IFERROR((VLOOKUP($A299,DATABASE!$A:$BU,17,0)),\"\")","v":0}]
[296,{"$f":"IFERROR((VLOOKUP($A300,DATABASE!$A:$BU,15,0)),\"\")","v":0},{"$f":"IFERROR((VLOOKUP($A300,DATABASE!$A:$BU,16,0)),\"\")","v":0},{"$f":"IFERROR((VLOOKUP($A300,DATABASE!$A:$BU,17,0)),\"\")","v":0}]
[297,{"$f":"IFERROR((VLOOKUP($A301,DATABASE!$A:$BU,15,0)),\"\")","v":0},{"$f":"IFERROR((VLOOKUP($A301,DATABASE!$A:$BU,16,0)),\"\")","v":0},{"$f":"IFERROR((VLOOKUP($A301,DATABASE!$A:$BU,17,0)),\"\")","v":0}]
[298,{"$f":"IFERROR((VLOOKUP($A302,DATABASE!$A:$BU,15,0)),\"\")","v":0},{"$f":"IFERROR((VLOOKUP($A302,DATABASE!$A:$BU,16,0)),\"\")","v":0},{"$f":"IFERROR((VLOOKUP($A302,DATABASE!$A:$BU,17,0)),\"\")","v":0}]
[299,{"$f":"IFERROR((VLOOKUP($A303,DATABASE!$A:$BU,15,0)),\"\")","v":0},{"$f":"IFERROR((VLOOKUP($A303,DATABASE!$A:$BU,16,0)),\"\")","v":0},{"$f":"IFERROR((VLOOKUP($A303,DATABASE!$A:$BU,17,0)),\"\")","v":0}]
[300,{"$f":"IFERROR((VLOOKUP($A304,DATABASE!$A:$BU,15,0)),\"\")","v":0},{"$f":"IFERROR((VLOOKUP($A304,DATABASE!$A:$BU,16,0)),\"\")","v":0},{"$f":"IFERROR((VLOOKUP($A304,DATABASE!$A:$BU,17,0)),\"\")","v":0}]
[301,{"$f":"IFERROR((VLOOKUP($A305,DATABASE!$A:$BU,15,0)),\"\")","v":0},{"$f":"IFERROR((VLOOKUP($A305,DATABASE!$A:$BU,16,0)),\"\")","v":0},{"$f":"IFERROR((VLOOKUP($A305,DATABASE!$A:$BU,17,0)),\"\")","v":0}]
[302,{"$f":"IFERROR((VLOOKUP($A306,DATABASE!$A:$BU,15,0)),\"\")","v":0},{"$f":"IFERROR((VLOOKUP($A306,DATABASE!$A:$BU,16,0)),\"\")","v":0},{"$f":"IFERROR((VLOOKUP($A306,DATABASE!$A:$BU,17,0)),\"\")","v":0}]
[303,{"$f":"IFERROR((VLOOKUP($A307,DATABASE!$A:$BU,15,0)),\"\")","v":0},{"$f":"IFERROR((VLOOKUP($A307,DATABASE!$A:$BU,16,0)),\"\")","v":0},{"$f":"IFERROR((VLOOKUP($A307,DATABASE!$A:$BU,17,0)),\"\")","v":0}]
[304,{"$f":"IFERROR((VLOOKUP($A308,DATABASE!$A:$BU,15,0)),\"\")","v":0},{"$f":"IFERROR((VLOOKUP($A308,DATABASE!$A:$BU,16,0)),\"\")","v":0},{"$f":"IFERROR((VLOOKUP($A308,DATABASE!$A:$BU,17,0)),\"\")","v":0}]
[305,{"$f":"IFERROR((VLOOKUP($A309,DATABASE!$A:$BU,15,0)),\"\")","v":0},{"$f":"IFERROR((VLOOKUP($A309,DATABASE!$A:$BU,16,0)),\"\")","v":0},{"$f":"IFERROR((VLOOKUP($A309,DATABASE!$A:$BU,17,0)),\"\")","v":0}]
[306,{"$f":"IFERROR((VLOOKUP($A310,DATABASE!$A:$BU,15,0)),\"\")","v":0},{"$f":"IFERROR((VLOOKUP($A310,DATABASE!$A:$BU,16,0)),\"\")","v":0},{"$f":"IFERROR((VLOOKUP($A310,DATABASE!$A:$BU,17,0)),\"\")","v":0}]
[307,{"$f":"IFERROR((VLOOKUP($A311,DATABASE!$A:$BU,15,0)),\"\")","v":0},{"$f":"IFERROR((VLOOKUP($A311,DATABASE!$A:$BU,16,0)),\"\")","v":0},{"$f":"IFERROR((VLOOKUP($A311,DATABASE!$A:$BU,17,0)),\"\")","v":0}]
[308,{"$f":"IFERROR((VLOOKUP($A312,DATABASE!$A:$BU,15,0)),\"\")","v":0},{"$f":"IFERROR((VLOOKUP($A312,DATABASE!$A:$BU,16,0)),\"\")","v":0},{"$f":"IFERROR((VLOOKUP($A312,DATABASE!$A:$BU,17,0)),\"\")","v":0}]
[309,{"$f":"IFERROR((VLOOKUP($A313,DATABASE!$A:$BU,15,0)),\"\")","v":0},{"$f":"IFERROR((VLOOKUP($A313,DATABASE!$A:$BU,16,0)),\"\")","v":0},{"$f":"IFERROR((VLOOKUP($A313,DATABASE!$A:$BU,17,0)),\"\")","v":0}]
[310,{"$f":"IFERROR((VLOOKUP($A314,DATABASE!$A:$BU,15,0)),\"\")","v":0},{"$f":"IFERROR((VLOOKUP($A314,DATABASE!$A:$BU,16,0)),\"\")","v":0},{"$f":"IFERROR((VLOOKUP($A314,DATABASE!$A:$BU,17,0)),\"\")","v":0}]
[311,{"$f":"IFERROR((VLOOKUP($A315,DATABASE!$A:$BU,15,0)),\"\")","v":0},{"$f":"IFERROR((VLOOKUP($A315,DATABASE!$A:$BU,16,0)),\"\")","v":0},{"$f":"IFERROR((VLOOKUP($A315,DATABASE!$A:$BU,17,0)),\"\")","v":0}]
[312,{"$f":"IFERROR((VLOOKUP($A316,DATABASE!$A:$BU,15,0)),\"\")","v":0},{"$f":"IFERROR((VLOOKUP($A316,DATABASE!$A:$BU,16,0)),\"\")","v":0},{"$f":"IFERROR((VLOOKUP($A316,DATABASE!$A:$BU,17,0)),\"\")","v":0}]
[313,{"$f":"IFERROR((VLOOKUP($A317,DATABASE!$A:$BU,15,0)),\"\")","v":0},{"$f":"IFERROR((VLOOKUP($A317,DATABASE!$A:$BU,16,0)),\"\")","v":0},{"$f":"IFERROR((VLOOKUP($A317,DATABASE!$A:$BU,17,0)),\"\")","v":0}]
[314,{"$f":"IFERROR((VLOOKUP($A318,DATABASE!$A:$BU,15,0)),\"\")","v":0},{"$f":"IFERROR((VLOOKUP($A318,DATABASE!$A:$BU,16,0)),\"\")","v":0},{"$f":"IFERROR((VLOOKUP($A318,DATABASE!$A:$BU,17,0)),\"\")","v":0}]
[315,{"$f":"IFERROR((VLOOKUP($A319,DATABASE!$A:$BU,15,0)),\"\")","v":0},{"$f":"IFERROR((VLOOKUP($A319,DATABASE!$A:$BU,16,0)),\"\")","v":0},{"$f":"IFERROR((VLOOKUP($A319,DATABASE!$A:$BU,17,0)),\"\")","v":0}]
[316,{"$f":"IFERROR((VLOOKUP($A320,DATABASE!$A:$BU,15,0)),\"\")","v":0},{"$f":"IFERROR((VLOOKUP($A320,DATABASE!$A:$BU,16,0)),\"\")","v":0},{"$f":"IFERROR((VLOOKUP($A320,DATABASE!$A:$BU,17,0)),\"\")","v":0}]
[317,{"$f":"IFERROR((VLOOKUP($A321,DATABASE!$A:$BU,15,0)),\"\")","v":0},{"$f":"IFERROR((VLOOKUP($A321,DATABASE!$A:$BU,16,0)),\"\")","v":0},{"$f":"IFERROR((VLOOKUP($A321,DATABASE!$A:$BU,17,0)),\"\")","v":0}]
[318,{"$f":"IFERROR((VLOOKUP($A322,DATABASE!$A:$BU,15,0)),\"\")","v":0},{"$f":"IFERROR((VLOOKUP($A322,DATABASE!$A:$BU,16,0)),\"\")","v":0},{"$f":"IFERROR((VLOOKUP($A322,DATABASE!$A:$BU,17,0)),\"\")","v":0}]
[319,{"$f":"IFERROR((VLOOKUP($A323,DATABASE!$A:$BU,15,0)),\"\")","v":0},{"$f":"IFERROR((VLOOKUP($A323,DATABASE!$A:$BU,16,0)),\"\")","v":0},{"$f":"IFERROR((VLOOKUP($A323,DATABASE!$A:$BU,17,0)),\"\")","v":0}]
[320,{"$f":"IFERROR((VLOOKUP($A324,DATABASE!$A:$BU,15,0)),\"\")","v":0},{"$f":"IFERROR((VLOOKUP($A324,DATABASE!$A:$BU,16,0)),\"\")","v":0},{"$f":"IFERROR((VLOOKUP($A324,DATABASE!$A:$BU,17,0)),\"\")","v":0}]
[321,{"$f":"IFERROR((VLOOKUP($A325,DATABASE!$A:$BU,15,0)),\"\")","v":0},{"$f":"IFERROR((VLOOKUP($A325,DATABASE!$A:$BU,16,0)),\"\")","v":0},{"$f":"IFERROR((VLOOKUP($A325,DATABASE!$A:$BU,17,0)),\"\")","v":0}]
[322,{"$f":"IFERROR((VLOOKUP($A326,DATABASE!$A:$BU,15,0)),\"\")","v":0},{"$f":"IFERROR((VLOOKUP($A326,DATABASE!$A:$BU,16,0)),\"\")","v":0},{"$f":"IFERROR((VLOOKUP($A326,DATABASE!$A:$BU,17,0)),\"\")","v":0}]
[323,{"$f":"IFERROR((VLOOKUP($A327,DATABASE!$A:$BU,15,0)),\"\")","v":0},{"$f":"IFERROR((VLOOKUP($A327,DATABASE!$A:$BU,16,0)),\"\")","v":0},{"$f":"IFERROR((VLOOKUP($A327,DATABASE!$A:$BU,17,0)),\"\")","v":0}]
[324,{"$f":"IFERROR((VLOOKUP($A328,DATABASE!$A:$BU,15,0)),\"\")","v":0},{"$f":"IFERROR((VLOOKUP($A328,DATABASE!$A:$BU,16,0)),\"\")","v":0},{"$f":"IFERROR((VLOOKUP($A328,DATABASE!$A:$BU,17,0)),\"\")","v":0}]
[325,{"$f":"IFERROR((VLOOKUP($A329,DATABASE!$A:$BU,15,0)),\"\")","v":0},{"$f":"IFERROR((VLOOKUP($A329,DATABASE!$A:$BU,16,0)),\"\")","v":0},{"$f":"IFERROR((VLOOKUP($A329,DATABASE!$A:$BU,17,0)),\"\")","v":0}]
[326,{"$f":"IFERROR((VLOOKUP($A330,DATABASE!$A:$BU,15,0)),\"\")","v":0},{"$f":"IFERROR((VLOOKUP($A330,DATABASE!$A:$BU,16,0)),\"\")","v":0},{"$f":"IFERROR((VLOOKUP($A330,DATABASE!$A:$BU,17,0)),\"\")","v":0}]
[327,{"$f":"IFERROR((VLOOKUP($A331,DATABASE!$A:$BU,15,0)),\"\")","v":0},{"$f":"IFERROR((VLOOKUP($A331,DATABASE!$A:$BU,16,0)),\"\")","v":0},{"$f":"IFERROR((VLOOKUP($A331,DATABASE!$A:$BU,17,0)),\"\")","v":0}]
[328,{"$f":"IFERROR((VLOOKUP($A332,DATABASE!$A:$BU,15,0)),\"\")","v":0},{"$f":"IFERROR((VLOOKUP($A332,DATABASE!$A:$BU,16,0)),\"\")","v":0},{"$f":"IFERROR((VLOOKUP($A332,DATABASE!$A:$BU,17,0)),\"\")","v":0}]
[329,{"$f":"IFERROR((VLOOKUP($A333,DATABASE!$A:$BU,15,0)),\"\")","v":0},{"$f":"IFERROR((VLOOKUP($A333,DATABASE!$A:$BU,16,0)),\"\")","v":0},{"$f":"IFERROR((VLOOKUP($A333,DATABASE!$A:$BU,17,0)),\"\")","v":0}]
[330,{"$f":"IFERROR((VLOOKUP($A334,DATABASE!$A:$BU,15,0)),\"\")","v":0},{"$f":"IFERROR((VLOOKUP($A334,DATABASE!$A:$BU,16,0)),\"\")","v":0},{"$f":"IFERROR((VLOOKUP($A334,DATABASE!$A:$BU,17,0)),\"\")","v":0}]
[331,{"$f":"IFERROR((VLOOKUP($A335,DATABASE!$A:$BU,15,0)),\"\")","v":0},{"$f":"IFERROR((VLOOKUP($A335,DATABASE!$A:$BU,16,0)),\"\")","v":0},{"$f":"IFERROR((VLOOKUP($A335,DATABASE!$A:$BU,17,0)),\"\")","v":0}]
[332,{"$f":"IFERROR((VLOOKUP($A336,DATABASE!$A:$BU,15,0)),\"\")","v":0},{"$f":"IFERROR((VLOOKUP($A336,DATABASE!$A:$BU,16,0)),\"\")","v":0},{"$f":"IFERROR((VLOOKUP($A336,DATABASE!$A:$BU,17,0)),\"\")","v":0}]
[333,{"$f":"IFERROR((VLOOKUP($A337,DATABASE!$A:$BU,15,0)),\"\")","v":0},{"$f":"IFERROR((VLOOKUP($A337,DATABASE!$A:$BU,16,0)),\"\")","v":0},{"$f":"IFERROR((VLOOKUP($A337,DATABASE!$A:$BU,17,0)),\"\")","v":0}]
[334,{"$f":"IFERROR((VLOOKUP($A338,DATABASE!$A:$BU,15,0)),\"\")","v":0},{"$f":"IFERROR((VLOOKUP($A338,DATABASE!$A:$BU,16,0)),\"\")","v":0},{"$f":"IFERROR((VLOOKUP($A338,DATABASE!$A:$BU,17,0)),\"\")","v":0}]
[335,{"$f":"IFERROR((VLOOKUP($A339,DATABASE!$A:$BU,15,0)),\"\")","v":0},{"$f":"IFERROR((VLOOKUP($A339,DATABASE!$A:$BU,16,0)),\"\")","v":0},{"$f":"IFERROR((VLOOKUP($A339,DATABASE!$A:$BU,17,0)),\"\")","v":0}]
[336,{"$f":"IFERROR((VLOOKUP($A340,DATABASE!$A:$BU,15,0)),\"\")","v":0},{"$f":"IFERROR((VLOOKUP($A340,DATABASE!$A:$BU,16,0)),\"\")","v":0},{"$f":"IFERROR((VLOOKUP($A340,DATABASE!$A:$BU,17,0)),\"\")","v":0}]
[337,{"$f":"IFERROR((VLOOKUP($A341,DATABASE!$A:$BU,15,0)),\"\")","v":0},{"$f":"IFERROR((VLOOKUP($A341,DATABASE!$A:$BU,16,0)),\"\")","v":0},{"$f":"IFERROR((VLOOKUP($A341,DATABASE!$A:$BU,17,0)),\"\")","v":0}]
[338,{"$f":"IFERROR((VLOOKUP($A342,DATABASE!$A:$BU,15,0)),\"\")","v":0},{"$f":"IFERROR((VLOOKUP($A342,DATABASE!$A:$BU,16,0)),\"\")","v":0},{"$f":"IFERROR((VLOOKUP($A342,DATABASE!$A:$BU,17,0)),\"\")","v":0}]
[339,{"$f":"IFERROR((VLOOKUP($A343,DATABASE!$A:$BU,15,0)),\"\")","v":0},{"$f":"IFERROR((VLOOKUP($A343,DATABASE!$A:$BU,16,0)),\"\")","v":0},{"$f":"IFERROR((VLOOKUP($A343,DATABASE!$A:$BU,17,0)),\"\")","v":0}]
[340,{"$f":"IFERROR((VLOOKUP($A344,DATABASE!$A:$BU,15,0)),\"\")","v":0},{"$f":"IFERROR((VLOOKUP($A344,DATABASE!$A:$BU,16,0)),\"\")","v":0},{"$f":"IFERROR((VLOOKUP($A344,DATABASE!$A:$BU,17,0)),\"\")","v":0}]
[341,{"$f":"IFERROR((VLOOKUP($A345,DATABASE!$A:$BU,15,0)),\"\")","v":0},{"$f":"IFERROR((VLOOKUP($A345,DATABASE!$A:$BU,16,0)),\"\")","v":0},{"$f":"IFERROR((VLOOKUP($A345,DATABASE!$A:$BU,17,0)),\"\")","v":0}]
[342,{"$f":"IFERROR((VLOOKUP($A346,DATABASE!$A:$BU,15,0)),\"\")","v":0},{"$f":"IFERROR((VLOOKUP($A346,DATABASE!$A:$BU,16,0)),\"\")","v":0},{"$f":"IFERROR((VLOOKUP($A346,DATABASE!$A:$BU,17,0)),\"\")","v":0}]
[343,{"$f":"IFERROR((VLOOKUP($A347,DATABASE!$A:$BU,15,0)),\"\")","v":0},{"$f":"IFERROR((VLOOKUP($A347,DATABASE!$A:$BU,16,0)),\"\")","v":0},{"$f":"IFERROR((VLOOKUP($A347,DATABASE!$A:$BU,17,0)),\"\")","v":0}]
[344,{"$f":"IFERROR((VLOOKUP($A348,DATABASE!$A:$BU,15,0)),\"\")","v":0},{"$f":"IFERROR((VLOOKUP($A348,DATABASE!$A:$BU,16,0)),\"\")","v":0},{"$f":"IFERROR((VLOOKUP($A348,DATABASE!$A:$BU,17,0)),\"\")","v":0}]
[345,{"$f":"IFERROR((VLOOKUP($A349,DATABASE!$A:$BU,15,0)),\"\")","v":0},{"$f":"IFERROR((VLOOKUP($A349,DATABASE!$A:$BU,16,0)),\"\")","v":0},{"$f":"IFERROR((VLOOKUP($A349,DATABASE!$A:$BU,17,0)),\"\")","v":0}]
[346,{"$f":"IFERROR((VLOOKUP($A350,DATABASE!$A:$BU,15,0)),\"\")","v":0},{"$f":"IFERROR((VLOOKUP($A350,DATABASE!$A:$BU,16,0)),\"\")","v":0},{"$f":"IFERROR((VLOOKUP($A350,DATABASE!$A:$BU,17,0)),\"\")","v":0}]
[347,{"$f":"IFERROR((VLOOKUP($A351,DATABASE!$A:$BU,15,0)),\"\")","v":0},{"$f":"IFERROR((VLOOKUP($A351,DATABASE!$A:$BU,16,0)),\"\")","v":0},{"$f":"IFERROR((VLOOKUP($A351,DATABASE!$A:$BU,17,0)),\"\")","v":0}]
[348,{"$f":"IFERROR((VLOOKUP($A352,DATABASE!$A:$BU,15,0)),\"\")","v":0},{"$f":"IFERROR((VLOOKUP($A352,DATABASE!$A:$BU,16,0)),\"\")","v":0},{"$f":"IFERROR((VLOOKUP($A352,DATABASE!$A:$BU,17,0)),\"\")","v":0}]
[349,{"$f":"IFERROR((VLOOKUP($A353,DATABASE!$A:$BU,15,0)),\"\")","v":0},{"$f":"IFERROR((VLOOKUP($A353,DATABASE!$A:$BU,16,0)),\"\")","v":0},{"$f":"IFERROR((VLOOKUP($A353,DATABASE!$A:$BU,17,0)),\"\")","v":0}]
[350,{"$f":"IFERROR((VLOOKUP($A354,DATABASE!$A:$BU,15,0)),\"\")","v":0},{"$f":"IFERROR((VLOOKUP($A354,DATABASE!$A:$BU,16,0)),\"\")","v":0},{"$f":"IFERROR((VLOOKUP($A354,DATABASE!$A:$BU,17,0)),\"\")","v":0}]
[351,{"$f":"IFERROR((VLOOKUP($A355,DATABASE!$A:$BU,15,0)),\"\")","v":0},{"$f":"IFERROR((VLOOKUP($A355,DATABASE!$A:$BU,16,0)),\"\")","v":0},{"$f":"IFERROR((VLOOKUP($A355,DATABASE!$A:$BU,17,0)),\"\")","v":0}]
[352,{"$f":"IFERROR((VLOOKUP($A356,DATABASE!$A:$BU,15,0)),\"\")","v":0},{"$f":"IFERROR((VLOOKUP($A356,DATABASE!$A:$BU,16,0)),\"\")","v":0},{"$f":"IFERROR((VLOOKUP($A356,DATABASE!$A:$BU,17,0)),\"\")","v":0}]
[353,{"$f":"IFERROR((VLOOKUP($A357,DATABASE!$A:$BU,15,0)),\"\")","v":0},{"$f":"IFERROR((VLOOKUP($A357,DATABASE!$A:$BU,16,0)),\"\")","v":0},{"$f":"IFERROR((VLOOKUP($A357,DATABASE!$A:$BU,17,0)),\"\")","v":0}]
[354,{"$f":"IFERROR((VLOOKUP($A358,DATABASE!$A:$BU,15,0)),\"\")","v":0},{"$f":"IFERROR((VLOOKUP($A358,DATABASE!$A:$BU,16,0)),\"\")","v":0},{"$f":"IFERROR((VLOOKUP($A358,DATABASE!$A:$BU,17,0)),\"\")","v":0}]
[355,{"$f":"IFERROR((VLOOKUP($A359,DATABASE!$A:$BU,15,0)),\"\")","v":0},{"$f":"IFERROR((VLOOKUP($A359,DATABASE!$A:$BU,16,0)),\"\")","v":0},{"$f":"IFERROR((VLOOKUP($A359,DATABASE!$A:$BU,17,0)),\"\")","v":0}]
[356,{"$f":"IFERROR((VLOOKUP($A360,DATABASE!$A:$BU,15,0)),\"\")","v":0},{"$f":"IFERROR((VLOOKUP($A360,DATABASE!$A:$BU,16,0)),\"\")","v":0},{"$f":"IFERROR((VLOOKUP($A360,DATABASE!$A:$BU,17,0)),\"\")","v":0}]
[357,{"$f":"IFERROR((VLOOKUP($A361,DATABASE!$A:$BU,15,0)),\"\")","v":0},{"$f":"IFERROR((VLOOKUP($A361,DATABASE!$A:$BU,16,0)),\"\")","v":0},{"$f":"IFERROR((VLOOKUP($A361,DATABASE!$A:$BU,17,0)),\"\")","v":0}]
[358,{"$f":"IFERROR((VLOOKUP($A362,DATABASE!$A:$BU,15,0)),\"\")","v":0},{"$f":"IFERROR((VLOOKUP($A362,DATABASE!$A:$BU,16,0)),\"\")","v":0},{"$f":"IFERROR((VLOOKUP($A362,DATABASE!$A:$BU,17,0)),\"\")","v":0}]
[359,{"$f":"IFERROR((VLOOKUP($A363,DATABASE!$A:$BU,15,0)),\"\")","v":0},{"$f":"IFERROR((VLOOKUP($A363,DATABASE!$A:$BU,16,0)),\"\")","v":0},{"$f":"IFERROR((VLOOKUP($A363,DATABASE!$A:$BU,17,0)),\"\")","v":0}]
[360,{"$f":"IFERROR((VLOOKUP($A364,DATABASE!$A:$BU,15,0)),\"\")","v":0},{"$f":"IFERROR((VLOOKUP($A364,DATABASE!$A:$BU,16,0)),\"\")","v":0},{"$f":"IFERROR((VLOOKUP($A364,DATABASE!$A:$BU,17,0)),\"\")","v":0}]
[361,{"$f":"IFERROR((VLOOKUP($A365,DATABASE!$A:$BU,15,0)),\"\")","v":0},{"$f":"IFERROR((VLOOKUP($A365,DATABASE!$A:$BU,16,0)),\"\")","v":0},{"$f":"IFERROR((VLOOKUP($A365,DATABASE!$A:$BU,17,0)),\"\")","v":0}]
[362,{"$f":"IFERROR((VLOOKUP($A366,DATABASE!$A:$BU,15,0)),\"\")","v":0},{"$f":"IFERROR((VLOOKUP($A366,DATABASE!$A:$BU,16,0)),\"\")","v":0},{"$f":"IFERROR((VLOOKUP($A366,DATABASE!$A:$BU,17,0)),\"\")","v":0}]
[363,{"$f":"IFERROR((VLOOKUP($A367,DATABASE!$A:$BU,15,0)),\"\")","v":0},{"$f":"IFERROR((VLOOKUP($A367,DATABASE!$A:$BU,16,0)),\"\")","v":0},{"$f":"IFERROR((VLOOKUP($A367,DATABASE!$A:$BU,17,0)),\"\")","v":0}]
[364,{"$f":"IFERROR((VLOOKUP($A368,DATABASE!$A:$BU,15,0)),\"\")","v":0},{"$f":"IFERROR((VLOOKUP($A368,DATABASE!$A:$BU,16,0)),\"\")","v":0},{"$f":"IFERROR((VLOOKUP($A368,DATABASE!$A:$BU,17,0)),\"\")","v":0}]
[365,{"$f":"IFERROR((VLOOKUP($A369,DATABASE!$A:$BU,15,0)),\"\")","v":0},{"$f":"IFERROR((VLOOKUP($A369,DATABASE!$A:$BU,16,0)),\"\")","v":0},{"$f":"IFERROR((VLOOKUP($A369,DATABASE!$A:$BU,17,0)),\"\")","v":0}]
[366,{"$f":"IFERROR((VLOOKUP($A370,DATABASE!$A:$BU,15,0)),\"\")","v":0},{"$f":"IFERROR((VLOOKUP($A370,DATABASE!$A:$BU,16,0)),\"\")","v":0},{"$f":"IFERROR((VLOOKUP($A370,DATABASE!$A:$BU,17,0)),\"\")","v":0}]
[367,{"$f":"IFERROR((VLOOKUP($A371,DATABASE!$A:$BU,15,0)),\"\")","v":0},{"$f":"IFERROR((VLOOKUP($A371,DATABASE!$A:$BU,16,0)),\"\")","v":0},{"$f":"IFERROR((VLOOKUP($A371,DATABASE!$A:$BU,17,0)),\"\")","v":0}]
[368,{"$f":"IFERROR((VLOOKUP($A372,DATABASE!$A:$BU,15,0)),\"\")","v":0},{"$f":"IFERROR((VLOOKUP($A372,DATABASE!$A:$BU,16,0)),\"\")","v":0},{"$f":"IFERROR((VLOOKUP($A372,DATABASE!$A:$BU,17,0)),\"\")","v":0}]
[369,{"$f":"IFERROR((VLOOKUP($A373,DATABASE!$A:$BU,15,0)),\"\")","v":0},{"$f":"IFERROR((VLOOKUP($A373,DATABASE!$A:$BU,16,0)),\"\")","v":0},{"$f":"IFERROR((VLOOKUP($A373,DATABASE!$A:$BU,17,0)),\"\")","v":0}]
[370,{"$f":"IFERROR((VLOOKUP($A374,DATABASE!$A:$BU,15,0)),\"\")","v":0},{"$f":"IFERROR((VLOOKUP($A374,DATABASE!$A:$BU,16,0)),\"\")","v":0},{"$f":"IFERROR((VLOOKUP($A374,DATABASE!$A:$BU,17,0)),\"\")","v":0}]
[371,{"$f":"IFERROR((VLOOKUP($A375,DATABASE!$A:$BU,15,0)),\"\")","v":0},{"$f":"IFERROR((VLOOKUP($A375,DATABASE!$A:$BU,16,0)),\"\")","v":0},{"$f":"IFERROR((VLOOKUP($A375,DATABASE!$A:$BU,17,0)),\"\")","v":0}]
[372,{"$f":"IFERROR((VLOOKUP($A376,DATABASE!$A:$BU,15,0)),\"\")","v":0},{"$f":"IFERROR((VLOOKUP($A376,DATABASE!$A:$BU,16,0)),\"\")","v":0},{"$f":"IFERROR((VLOOKUP($A376,DATABASE!$A:$BU,17,0)),\"\")","v":0}]
[373,{"$f":"IFERROR((VLOOKUP($A377,DATABASE!$A:$BU,15,0)),\"\")","v":0},{"$f":"IFERROR((VLOOKUP($A377,DATABASE!$A:$BU,16,0)),\"\")","v":0},{"$f":"IFERROR((VLOOKUP($A377,DATABASE!$A:$BU,17,0)),\"\")","v":0}]
[374,{"$f":"IFERROR((VLOOKUP($A378,DATABASE!$A:$BU,15,0)),\"\")","v":0},{"$f":"IFERROR((VLOOKUP($A378,DATABASE!$A:$BU,16,0)),\"\")","v":0},{"$f":"IFERROR((VLOOKUP($A378,DATABASE!$A:$BU,17,0)),\"\")","v":0}]
[375,{"$f":"IFERROR((VLOOKUP($A379,DATABASE!$A:$BU,15,0)),\"\")","v":0},{"$f":"IFERROR((VLOOKUP($A379,DATABASE!$A:$BU,16,0)),\"\")","v":0},{"$f":"IFERROR((VLOOKUP($A379,DATABASE!$A:$BU,17,0)),\"\")","v":0}]
[376,{"$f":"IFERROR((VLOOKUP($A380,DATABASE!$A:$BU,15,0)),\"\")","v":0},{"$f":"IFERROR((VLOOKUP($A380,DATABASE!$A:$BU,16,0)),\"\")","v":0},{"$f":"IFERROR((VLOOKUP($A380,DATABASE!$A:$BU,17,0)),\"\")","v":0}]
[377,{"$f":"IFERROR((VLOOKUP($A381,DATABASE!$A:$BU,15,0)),\"\")","v":0},{"$f":"IFERROR((VLOOKUP($A381,DATABASE!$A:$BU,16,0)),\"\")","v":0},{"$f":"IFERROR((VLOOKUP($A381,DATABASE!$A:$BU,17,0)),\"\")","v":0}]
[378,{"$f":"IFERROR((VLOOKUP($A382,DATABASE!$A:$BU,15,0)),\"\")","v":0},{"$f":"IFERROR((VLOOKUP($A382,DATABASE!$A:$BU,16,0)),\"\")","v":0},{"$f":"IFERROR((VLOOKUP($A382,DATABASE!$A:$BU,17,0)),\"\")","v":0}]
[379,{"$f":"IFERROR((VLOOKUP($A383,DATABASE!$A:$BU,15,0)),\"\")","v":0},{"$f":"IFERROR((VLOOKUP($A383,DATABASE!$A:$BU,16,0)),\"\")","v":0},{"$f":"IFERROR((VLOOKUP($A383,DATABASE!$A:$BU,17,0)),\"\")","v":0}]
[380,{"$f":"IFERROR((VLOOKUP($A384,DATABASE!$A:$BU,15,0)),\"\")","v":0},{"$f":"IFERROR((VLOOKUP($A384,DATABASE!$A:$BU,16,0)),\"\")","v":0},{"$f":"IFERROR((VLOOKUP($A384,DATABASE!$A:$BU,17,0)),\"\")","v":0}]
[381,{"$f":"IFERROR((VLOOKUP($A385,DATABASE!$A:$BU,15,0)),\"\")","v":0},{"$f":"IFERROR((VLOOKUP($A385,DATABASE!$A:$BU,16,0)),\"\")","v":0},{"$f":"IFERROR((VLOOKUP($A385,DATABASE!$A:$BU,17,0)),\"\")","v":0}]
[382,{"$f":"IFERROR((VLOOKUP($A386,DATABASE!$A:$BU,15,0)),\"\")","v":0},{"$f":"IFERROR((VLOOKUP($A386,DATABASE!$A:$BU,16,0)),\"\")","v":0},{"$f":"IFERROR((VLOOKUP($A386,DATABASE!$A:$BU,17,0)),\"\")","v":0}]
[383,{"$f":"IFERROR((VLOOKUP($A387,DATABASE!$A:$BU,15,0)),\"\")","v":0},{"$f":"IFERROR((VLOOKUP($A387,DATABASE!$A:$BU,16,0)),\"\")","v":0},{"$f":"IFERROR((VLOOKUP($A387,DATABASE!$A:$BU,17,0)),\"\")","v":0}]
[384,{"$f":"IFERROR((VLOOKUP($A388,DATABASE!$A:$BU,15,0)),\"\")","v":0},{"$f":"IFERROR((VLOOKUP($A388,DATABASE!$A:$BU,16,0)),\"\")","v":0},{"$f":"IFERROR((VLOOKUP($A388,DATABASE!$A:$BU,17,0)),\"\")","v":0}]
[385,{"$f":"IFERROR((VLOOKUP($A389,DATABASE!$A:$BU,15,0)),\"\")","v":0},{"$f":"IFERROR((VLOOKUP($A389,DATABASE!$A:$BU,16,0)),\"\")","v":0},{"$f":"IFERROR((VLOOKUP($A389,DATABASE!$A:$BU,17,0)),\"\")","v":0}]
[386,{"$f":"IFERROR((VLOOKUP($A390,DATABASE!$A:$BU,15,0)),\"\")","v":0},{"$f":"IFERROR((VLOOKUP($A390,DATABASE!$A:$BU,16,0)),\"\")","v":0},{"$f":"IFERROR((VLOOKUP($A390,DATABASE!$A:$BU,17,0)),\"\")","v":0}]
[387,{"$f":"IFERROR((VLOOKUP($A391,DATABASE!$A:$BU,15,0)),\"\")","v":0},{"$f":"IFERROR((VLOOKUP($A391,DATABASE!$A:$BU,16,0)),\"\")","v":0},{"$f":"IFERROR((VLOOKUP($A391,DATABASE!$A:$BU,17,0)),\"\")","v":0}]
[388,{"$f":"IFERROR((VLOOKUP($A392,DATABASE!$A:$BU,15,0)),\"\")","v":0},{"$f":"IFERROR((VLOOKUP($A392,DATABASE!$A:$BU,16,0)),\"\")","v":0},{"$f":"IFERROR((VLOOKUP($A392,DATABASE!$A:$BU,17,0)),\"\")","v":0}]
[389,{"$f":"IFERROR((VLOOKUP($A393,DATABASE!$A:$BU,15,0)),\"\")","v":0},{"$f":"IFERROR((VLOOKUP($A393,DATABASE!$A:$BU,16,0)),\"\")","v":0},{"$f":"IFERROR((VLOOKUP($A393,DATABASE!$A:$BU,17,0)),\"\")","v":0}]
[390,{"$f":"IFERROR((VLOOKUP($A394,DATABASE!$A:$BU,15,0)),\"\")","v":0},{"$f":"IFERROR((VLOOKUP($A394,DATABASE!$A:$BU,16,0)),\"\")","v":0},{"$f":"IFERROR((VLOOKUP($A394,DATABASE!$A:$BU,17,0)),\"\")","v":0}]
[391,{"$f":"IFERROR((VLOOKUP($A395,DATABASE!$A:$BU,15,0)),\"\")","v":0},{"$f":"IFERROR((VLOOKUP($A395,DATABASE!$A:$BU,16,0)),\"\")","v":0},{"$f":"IFERROR((VLOOKUP($A395,DATABASE!$A:$BU,17,0)),\"\")","v":0}]
[392,{"$f":"IFERROR((VLOOKUP($A396,DATABASE!$A:$BU,15,0)),\"\")","v":0},{"$f":"IFERROR((VLOOKUP($A396,DATABASE!$A:$BU,16,0)),\"\")","v":0},{"$f":"IFERROR((VLOOKUP($A396,DATABASE!$A:$BU,17,0)),\"\")","v":0}]
[393,{"$f":"IFERROR((VLOOKUP($A397,DATABASE!$A:$BU,15,0)),\"\")","v":0},{"$f":"IFERROR((VLOOKUP($A397,DATABASE!$A:$BU,16,0)),\"\")","v":0},{"$f":"IFERROR((VLOOKUP($A397,DATABASE!$A:$BU,17,0)),\"\")","v":0}]
[394,{"$f":"IFERROR((VLOOKUP($A398,DATABASE!$A:$BU,15,0)),\"\")","v":0},{"$f":"IFERROR((VLOOKUP($A398,DATABASE!$A:$BU,16,0)),\"\")","v":0},{"$f":"IFERROR((VLOOKUP($A398,DATABASE!$A:$BU,17,0)),\"\")","v":0}]
[395,{"$f":"IFERROR((VLOOKUP($A399,DATABASE!$A:$BU,15,0)),\"\")","v":0},{"$f":"IFERROR((VLOOKUP($A399,DATABASE!$A:$BU,16,0)),\"\")","v":0},{"$f":"IFERROR((VLOOKUP($A399,DATABASE!$A:$BU,17,0)),\"\")","v":0}]
[396,{"$f":"IFERROR((VLOOKUP($A400,DATABASE!$A:$BU,15,0)),\"\")","v":0},{"$f":"IFERROR((VLOOKUP($A400,DATABASE!$A:$BU,16,0)),\"\")","v":0},{"$f":"IFERROR((VLOOKUP($A400,DATABASE!$A:$BU,17,0)),\"\")","v":0}]
[397,{"$f":"IFERROR((VLOOKUP($A401,DATABASE!$A:$BU,15,0)),\"\")","v":0},{"$f":"IFERROR((VLOOKUP($A401,DATABASE!$A:$BU,16,0)),\"\")","v":0},{"$f":"IFERROR((VLOOKUP($A401,DATABASE!$A:$BU,17,0)),\"\")","v":0}]
[398,{"$f":"IFERROR((VLOOKUP($A402,DATABASE!$A:$BU,15,0)),\"\")","v":0},{"$f":"IFERROR((VLOOKUP($A402,DATABASE!$A:$BU,16,0)),\"\")","v":0},{"$f":"IFERROR((VLOOKUP($A402,DATABASE!$A:$BU,17,0)),\"\")","v":0}]
[399,{"$f":"IFERROR((VLOOKUP($A403,DATABASE!$A:$BU,15,0)),\"\")","v":0},{"$f":"IFERROR((VLOOKUP($A403,DATABASE!$A:$BU,16,0)),\"\")","v":0},{"$f":"IFERROR((VLOOKUP($A403,DATABASE!$A:$BU,17,0)),\"\")","v":0}]
[400,{"$f":"IFERROR((VLOOKUP($A404,DATABASE!$A:$BU,15,0)),\"\")","v":0},{"$f":"IFERROR((VLOOKUP($A404,DATABASE!$A:$BU,16,0)),\"\")","v":0},{"$f":"IFERROR((VLOOKUP($A404,DATABASE!$A:$BU,17,0)),\"\")","v":0}]
[401,{"$f":"IFERROR((VLOOKUP($A405,DATABASE!$A:$BU,15,0)),\"\")","v":0},{"$f":"IFERROR((VLOOKUP($A405,DATABASE!$A:$BU,16,0)),\"\")","v":0},{"$f":"IFERROR((VLOOKUP($A405,DATABASE!$A:$BU,17,0)),\"\")","v":0}]
[402,{"$f":"IFERROR((VLOOKUP($A406,DATABASE!$A:$BU,15,0)),\"\")","v":0},{"$f":"IFERROR((VLOOKUP($A406,DATABASE!$A:$BU,16,0)),\"\")","v":0},{"$f":"IFERROR((VLOOKUP($A406,DATABASE!$A:$BU,17,0)),\"\")","v":0}]
[403,{"$f":"IFERROR((VLOOKUP($A407,DATABASE!$A:$BU,15,0)),\"\")","v":0},{"$f":"IFERROR((VLOOKUP($A407,DATABASE!$A:$BU,16,0)),\"\")","v":0},{"$f":"IFERROR((VLOOKUP($A407,DATABASE!$A:$BU,17,0)),\"\")","v":0}]
[404,{"$f":"IFERROR((VLOOKUP($A408,DATABASE!$A:$BU,15,0)),\"\")","v":0},{"$f":"IFERROR((VLOOKUP($A408,DATABASE!$A:$BU,16,0)),\"\")","v":0},{"$f":"IFERROR((VLOOKUP($A408,DATABASE!$A:$BU,17,0)),\"\")","v":0}]
[405,{"$f":"IFERROR((VLOOKUP($A409,DATABASE!$A:$BU,15,0)),\"\")","v":0},{"$f":"IFERROR((VLOOKUP($A409,DATABASE!$A:$BU,16,0)),\"\")","v":0},{"$f":"IFERROR((VLOOKUP($A409,DATABASE!$A:$BU,17,0)),\"\")","v":0}]
[406,{"$f":"IFERROR((VLOOKUP($A410,DATABASE!$A:$BU,15,0)),\"\")","v":0},{"$f":"IFERROR((VLOOKUP($A410,DATABASE!$A:$BU,16,0)),\"\")","v":0},{"$f":"IFERROR((VLOOKUP($A410,DATABASE!$A:$BU,17,0)),\"\")","v":0}]
[407,{"$f":"IFERROR((VLOOKUP($A411,DATABASE!$A:$BU,15,0)),\"\")","v":0},{"$f":"IFERROR((VLOOKUP($A411,DATABASE!$A:$BU,16,0)),\"\")","v":0},{"$f":"IFERROR((VLOOKUP($A411,DATABASE!$A:$BU,17,0)),\"\")","v":0}]
[408,{"$f":"IFERROR((VLOOKUP($A412,DATABASE!$A:$BU,15,0)),\"\")","v":0},{"$f":"IFERROR((VLOOKUP($A412,DATABASE!$A:$BU,16,0)),\"\")","v":0},{"$f":"IFERROR((VLOOKUP($A412,DATABASE!$A:$BU,17,0)),\"\")","v":0}]
[409,{"$f":"IFERROR((VLOOKUP($A413,DATABASE!$A:$BU,15,0)),\"\")","v":0},{"$f":"IFERROR((VLOOKUP($A413,DATABASE!$A:$BU,16,0)),\"\")","v":0},{"$f":"IFERROR((VLOOKUP($A413,DATABASE!$A:$BU,17,0)),\"\")","v":0}]
[410,{"$f":"IFERROR((VLOOKUP($A414,DATABASE!$A:$BU,15,0)),\"\")","v":0},{"$f":"IFERROR((VLOOKUP($A414,DATABASE!$A:$BU,16,0)),\"\")","v":0},{"$f":"IFERROR((VLOOKUP($A414,DATABASE!$A:$BU,17,0)),\"\")","v":0}]
[411,{"$f":"IFERROR((VLOOKUP($A415,DATABASE!$A:$BU,15,0)),\"\")","v":0},{"$f":"IFERROR((VLOOKUP($A415,DATABASE!$A:$BU,16,0)),\"\")","v":0},{"$f":"IFERROR((VLOOKUP($A415,DATABASE!$A:$BU,17,0)),\"\")","v":0}]
[412,{"$f":"IFERROR((VLOOKUP($A416,DATABASE!$A:$BU,15,0)),\"\")","v":0},{"$f":"IFERROR((VLOOKUP($A416,DATABASE!$A:$BU,16,0)),\"\")","v":0},{"$f":"IFERROR((VLOOKUP($A416,DATABASE!$A:$BU,17,0)),\"\")","v":0}]
[413,{"$f":"IFERROR((VLOOKUP($A417,DATABASE!$A:$BU,15,0)),\"\")","v":0},{"$f":"IFERROR((VLOOKUP($A417,DATABASE!$A:$BU,16,0)),\"\")","v":0},{"$f":"IFERROR((VLOOKUP($A417,DATABASE!$A:$BU,17,0)),\"\")","v":0}]
[414,{"$f":"IFERROR((VLOOKUP($A418,DATABASE!$A:$BU,15,0)),\"\")","v":0},{"$f":"IFERROR((VLOOKUP($A418,DATABASE!$A:$BU,16,0)),\"\")","v":0},{"$f":"IFERROR((VLOOKUP($A418,DATABASE!$A:$BU,17,0)),\"\")","v":0}]
[415,{"$f":"IFERROR((VLOOKUP($A419,DATABASE!$A:$BU,15,0)),\"\")","v":0},{"$f":"IFERROR((VLOOKUP($A419,DATABASE!$A:$BU,16,0)),\"\")","v":0},{"$f":"IFERROR((VLOOKUP($A419,DATABASE!$A:$BU,17,0)),\"\")","v":0}]
[416,{"$f":"IFERROR((VLOOKUP($A420,DATABASE!$A:$BU,15,0)),\"\")","v":0},{"$f":"IFERROR((VLOOKUP($A420,DATABASE!$A:$BU,16,0)),\"\")","v":0},{"$f":"IFERROR((VLOOKUP($A420,DATABASE!$A:$BU,17,0)),\"\")","v":0}]
[417,{"$f":"IFERROR((VLOOKUP($A421,DATABASE!$A:$BU,15,0)),\"\")","v":0},{"$f":"IFERROR((VLOOKUP($A421,DATABASE!$A:$BU,16,0)),\"\")","v":0},{"$f":"IFERROR((VLOOKUP($A421,DATABASE!$A:$BU,17,0)),\"\")","v":0}]
[418,{"$f":"IFERROR((VLOOKUP($A422,DATABASE!$A:$BU,15,0)),\"\")","v":0},{"$f":"IFERROR((VLOOKUP($A422,DATABASE!$A:$BU,16,0)),\"\")","v":0},{"$f":"IFERROR((VLOOKUP($A422,DATABASE!$A:$BU,17,0)),\"\")","v":0}]
[419,{"$f":"IFERROR((VLOOKUP($A423,DATABASE!$A:$BU,15,0)),\"\")","v":0},{"$f":"IFERROR((VLOOKUP($A423,DATABASE!$A:$BU,16,0)),\"\")","v":0},{"$f":"IFERROR((VLOOKUP($A423,DATABASE!$A:$BU,17,0)),\"\")","v":0}]
[420,{"$f":"IFERROR((VLOOKUP($A424,DATABASE!$A:$BU,15,0)),\"\")","v":0},{"$f":"IFERROR((VLOOKUP($A424,DATABASE!$A:$BU,16,0)),\"\")","v":0},{"$f":"IFERROR((VLOOKUP($A424,DATABASE!$A:$BU,17,0)),\"\")","v":0}]
[421,{"$f":"IFERROR((VLOOKUP($A425,DATABASE!$A:$BU,15,0)),\"\")","v":0},{"$f":"IFERROR((VLOOKUP($A425,DATABASE!$A:$BU,16,0)),\"\")","v":0},{"$f":"IFERROR((VLOOKUP($A425,DATABASE!$A:$BU,17,0)),\"\")","v":0}]
[422,{"$f":"IFERROR((VLOOKUP($A426,DATABASE!$A:$BU,15,0)),\"\")","v":0},{"$f":"IFERROR((VLOOKUP($A426,DATABASE!$A:$BU,16,0)),\"\")","v":0},{"$f":"IFERROR((VLOOKUP($A426,DATABASE!$A:$BU,17,0)),\"\")","v":0}]
[423,{"$f":"IFERROR((VLOOKUP($A427,DATABASE!$A:$BU,15,0)),\"\")","v":0},{"$f":"IFERROR((VLOOKUP($A427,DATABASE!$A:$BU,16,0)),\"\")","v":0},{"$f":"IFERROR((VLOOKUP($A427,DATABASE!$A:$BU,17,0)),\"\")","v":0}]
[424,{"$f":"IFERROR((VLOOKUP($A428,DATABASE!$A:$BU,15,0)),\"\")","v":0},{"$f":"IFERROR((VLOOKUP($A428,DATABASE!$A:$BU,16,0)),\"\")","v":0},{"$f":"IFERROR((VLOOKUP($A428,DATABASE!$A:$BU,17,0)),\"\")","v":0}]
[425,{"$f":"IFERROR((VLOOKUP($A429,DATABASE!$A:$BU,15,0)),\"\")","v":0},{"$f":"IFERROR((VLOOKUP($A429,DATABASE!$A:$BU,16,0)),\"\")","v":0},{"$f":"IFERROR((VLOOKUP($A429,DATABASE!$A:$BU,17,0)),\"\")","v":0}]
[426,{"$f":"IFERROR((VLOOKUP($A430,DATABASE!$A:$BU,15,0)),\"\")","v":0},{"$f":"IFERROR((VLOOKUP($A430,DATABASE!$A:$BU,16,0)),\"\")","v":0},{"$f":"IFERROR((VLOOKUP($A430,DATABASE!$A:$BU,17,0)),\"\")","v":0}]
[427,{"$f":"IFERROR((VLOOKUP($A431,DATABASE!$A:$BU,15,0)),\"\")","v":0},{"$f":"IFERROR((VLOOKUP($A431,DATABASE!$A:$BU,16,0)),\"\")","v":0},{"$f":"IFERROR((VLOOKUP($A431,DATABASE!$A:$BU,17,0)),\"\")","v":0}]
[428,{"$f":"IFERROR((VLOOKUP($A432,DATABASE!$A:$BU,15,0)),\"\")","v":0},{"$f":"IFERROR((VLOOKUP($A432,DATABASE!$A:$BU,16,0)),\"\")","v":0},{"$f":"IFERROR((VLOOKUP($A432,DATABASE!$A:$BU,17,0)),\"\")","v":0}]
[429,{"$f":"IFERROR((VLOOKUP($A433,DATABASE!$A:$BU,15,0)),\"\")","v":0},{"$f":"IFERROR((VLOOKUP($A433,DATABASE!$A:$BU,16,0)),\"\")","v":0},{"$f":"IFERROR((VLOOKUP($A433,DATABASE!$A:$BU,17,0)),\"\")","v":0}]
[430,{"$f":"IFERROR((VLOOKUP($A434,DATABASE!$A:$BU,15,0)),\"\")","v":0},{"$f":"IFERROR((VLOOKUP($A434,DATABASE!$A:$BU,16,0)),\"\")","v":0},{"$f":"IFERROR((VLOOKUP($A434,DATABASE!$A:$BU,17,0)),\"\")","v":0}]
[431,{"$f":"IFERROR((VLOOKUP($A435,DATABASE!$A:$BU,15,0)),\"\")","v":0},{"$f":"IFERROR((VLOOKUP($A435,DATABASE!$A:$BU,16,0)),\"\")","v":0},{"$f":"IFERROR((VLOOKUP($A435,DATABASE!$A:$BU,17,0)),\"\")","v":0}]
[432,{"$f":"IFERROR((VLOOKUP($A436,DATABASE!$A:$BU,15,0)),\"\")","v":0},{"$f":"IFERROR((VLOOKUP($A436,DATABASE!$A:$BU,16,0)),\"\")","v":0},{"$f":"IFERROR((VLOOKUP($A436,DATABASE!$A:$BU,17,0)),\"\")","v":0}]
[433,{"$f":"IFERROR((VLOOKUP($A437,DATABASE!$A:$BU,15,0)),\"\")","v":0},{"$f":"IFERROR((VLOOKUP($A437,DATABASE!$A:$BU,16,0)),\"\")","v":0},{"$f":"IFERROR((VLOOKUP($A437,DATABASE!$A:$BU,17,0)),\"\")","v":0}]
[434,{"$f":"IFERROR((VLOOKUP($A438,DATABASE!$A:$BU,15,0)),\"\")","v":0},{"$f":"IFERROR((VLOOKUP($A438,DATABASE!$A:$BU,16,0)),\"\")","v":0},{"$f":"IFERROR((VLOOKUP($A438,DATABASE!$A:$BU,17,0)),\"\")","v":0}]
[435,{"$f":"IFERROR((VLOOKUP($A439,DATABASE!$A:$BU,15,0)),\"\")","v":0},{"$f":"IFERROR((VLOOKUP($A439,DATABASE!$A:$BU,16,0)),\"\")","v":0},{"$f":"IFERROR((VLOOKUP($A439,DATABASE!$A:$BU,17,0)),\"\")","v":0}]
[436,{"$f":"IFERROR((VLOOKUP($A440,DATABASE!$A:$BU,15,0)),\"\")","v":0},{"$f":"IFERROR((VLOOKUP($A440,DATABASE!$A:$BU,16,0)),\"\")","v":0},{"$f":"IFERROR((VLOOKUP($A440,DATABASE!$A:$BU,17,0)),\"\")","v":0}]
[437,{"$f":"IFERROR((VLOOKUP($A441,DATABASE!$A:$BU,15,0)),\"\")","v":0},{"$f":"IFERROR((VLOOKUP($A441,DATABASE!$A:$BU,16,0)),\"\")","v":0},{"$f":"IFERROR((VLOOKUP($A441,DATABASE!$A:$BU,17,0)),\"\")","v":0}]
[438,{"$f":"IFERROR((VLOOKUP($A442,DATABASE!$A:$BU,15,0)),\"\")","v":0},{"$f":"IFERROR((VLOOKUP($A442,DATABASE!$A:$BU,16,0)),\"\")","v":0},{"$f":"IFERROR((VLOOKUP($A442,DATABASE!$A:$BU,17,0)),\"\")","v":0}]
[439,{"$f":"IFERROR((VLOOKUP($A443,DATABASE!$A:$BU,15,0)),\"\")","v":0},{"$f":"IFERROR((VLOOKUP($A443,DATABASE!$A:$BU,16,0)),\"\")","v":0},{"$f":"IFERROR((VLOOKUP($A443,DATABASE!$A:$BU,17,0)),\"\")","v":0}]
[440,{"$f":"IFERROR((VLOOKUP($A444,DATABASE!$A:$BU,15,0)),\"\")","v":0},{"$f":"IFERROR((VLOOKUP($A444,DATABASE!$A:$BU,16,0)),\"\")","v":0},{"$f":"IFERROR((VLOOKUP($A444,DATABASE!$A:$BU,17,0)),\"\")","v":0}]
[441,{"$f":"IFERROR((VLOOKUP($A445,DATABASE!$A:$BU,15,0)),\"\")","v":0},{"$f":"IFERROR((VLOOKUP($A445,DATABASE!$A:$BU,16,0)),\"\")","v":0},{"$f":"IFERROR((VLOOKUP($A445,DATABASE!$A:$BU,17,0)),\"\")","v":0}]
[442,{"$f":"IFERROR((VLOOKUP($A446,DATABASE!$A:$BU,15,0)),\"\")","v":0},{"$f":"IFERROR((VLOOKUP($A446,DATABASE!$A:$BU,16,0)),\"\")","v":0},{"$f":"IFERROR((VLOOKUP($A446,DATABASE!$A:$BU,17,0)),\"\")","v":0}]
[443,{"$f":"IFERROR((VLOOKUP($A447,DATABASE!$A:$BU,15,0)),\"\")","v":0},{"$f":"IFERROR((VLOOKUP($A447,DATABASE!$A:$BU,16,0)),\"\")","v":0},{"$f":"IFERROR((VLOOKUP($A447,DATABASE!$A:$BU,17,0)),\"\")","v":0}]
[444,{"$f":"IFERROR((VLOOKUP($A448,DATABASE!$A:$BU,15,0)),\"\")","v":0},{"$f":"IFERROR((VLOOKUP($A448,DATABASE!$A:$BU,16,0)),\"\")","v":0},{"$f":"IFERROR((VLOOKUP($A448,DATABASE!$A:$BU,17,0)),\"\")","v":0}]
[445,{"$f":"IFERROR((VLOOKUP($A449,DATABASE!$A:$BU,15,0)),\"\")","v":0},{"$f":"IFERROR((VLOOKUP($A449,DATABASE!$A:$BU,16,0)),\"\")","v":0},{"$f":"IFERROR((VLOOKUP($A449,DATABASE!$A:$BU,17,0)),\"\")","v":0}]
[446,{"$f":"IFERROR((VLOOKUP($A450,DATABASE!$A:$BU,15,0)),\"\")","v":0},{"$f":"IFERROR((VLOOKUP($A450,DATABASE!$A:$BU,16,0)),\"\")","v":0},{"$f":"IFERROR((VLOOKUP($A450,DATABASE!$A:$BU,17,0)),\"\")","v":0}]
[447,{"$f":"IFERROR((VLOOKUP($A451,DATABASE!$A:$BU,15,0)),\"\")","v":0},{"$f":"IFERROR((VLOOKUP($A451,DATABASE!$A:$BU,16,0)),\"\")","v":0},{"$f":"IFERROR((VLOOKUP($A451,DATABASE!$A:$BU,17,0)),\"\")","v":0}]
[448,{"$f":"IFERROR((VLOOKUP($A452,DATABASE!$A:$BU,15,0)),\"\")","v":0},{"$f":"IFERROR((VLOOKUP($A452,DATABASE!$A:$BU,16,0)),\"\")","v":0},{"$f":"IFERROR((VLOOKUP($A452,DATABASE!$A:$BU,17,0)),\"\")","v":0}]
[449,{"$f":"IFERROR((VLOOKUP($A453,DATABASE!$A:$BU,15,0)),\"\")","v":0},{"$f":"IFERROR((VLOOKUP($A453,DATABASE!$A:$BU,16,0)),\"\")","v":0},{"$f":"IFERROR((VLOOKUP($A453,DATABASE!$A:$BU,17,0)),\"\")","v":0}]
[450,{"$f":"IFERROR((VLOOKUP($A454,DATABASE!$A:$BU,15,0)),\"\")","v":0},{"$f":"IFERROR((VLOOKUP($A454,DATABASE!$A:$BU,16,0)),\"\")","v":0},{"$f":"IFERROR((VLOOKUP($A454,DATABASE!$A:$BU,17,0)),\"\")","v":0}]
[451,{"$f":"IFERROR((VLOOKUP($A455,DATABASE!$A:$BU,15,0)),\"\")","v":0},{"$f":"IFERROR((VLOOKUP($A455,DATABASE!$A:$BU,16,0)),\"\")","v":0},{"$f":"IFERROR((VLOOKUP($A455,DATABASE!$A:$BU,17,0)),\"\")","v":0}]
[452,{"$f":"IFERROR((VLOOKUP($A456,DATABASE!$A:$BU,15,0)),\"\")","v":0},{"$f":"IFERROR((VLOOKUP($A456,DATABASE!$A:$BU,16,0)),\"\")","v":0},{"$f":"IFERROR((VLOOKUP($A456,DATABASE!$A:$BU,17,0)),\"\")","v":0}]
[453,{"$f":"IFERROR((VLOOKUP($A457,DATABASE!$A:$BU,15,0)),\"\")","v":0},{"$f":"IFERROR((VLOOKUP($A457,DATABASE!$A:$BU,16,0)),\"\")","v":0},{"$f":"IFERROR((VLOOKUP($A457,DATABASE!$A:$BU,17,0)),\"\")","v":0}]
[454,{"$f":"IFERROR((VLOOKUP($A458,DATABASE!$A:$BU,15,0)),\"\")","v":0},{"$f":"IFERROR((VLOOKUP($A458,DATABASE!$A:$BU,16,0)),\"\")","v":0},{"$f":"IFERROR((VLOOKUP($A458,DATABASE!$A:$BU,17,0)),\"\")","v":0}]
[455,{"$f":"IFERROR((VLOOKUP($A459,DATABASE!$A:$BU,15,0)),\"\")","v":0},{"$f":"IFERROR((VLOOKUP($A459,DATABASE!$A:$BU,16,0)),\"\")","v":0},{"$f":"IFERROR((VLOOKUP($A459,DATABASE!$A:$BU,17,0)),\"\")","v":0}]
[456,{"$f":"IFERROR((VLOOKUP($A460,DATABASE!$A:$BU,15,0)),\"\")","v":0},{"$f":"IFERROR((VLOOKUP($A460,DATABASE!$A:$BU,16,0)),\"\")","v":0},{"$f":"IFERROR((VLOOKUP($A460,DATABASE!$A:$BU,17,0)),\"\")","v":0}]
[457,{"$f":"IFERROR((VLOOKUP($A461,DATABASE!$A:$BU,15,0)),\"\")","v":0},{"$f":"IFERROR((VLOOKUP($A461,DATABASE!$A:$BU,16,0)),\"\")","v":0},{"$f":"IFERROR((VLOOKUP($A461,DATABASE!$A:$BU,17,0)),\"\")","v":0}]
[458,{"$f":"IFERROR((VLOOKUP($A462,DATABASE!$A:$BU,15,0)),\"\")","v":0},{"$f":"IFERROR((VLOOKUP($A462,DATABASE!$A:$BU,16,0)),\"\")","v":0},{"$f":"IFERROR((VLOOKUP($A462,DATABASE!$A:$BU,17,0)),\"\")","v":0}]
[459,{"$f":"IFERROR((VLOOKUP($A463,DATABASE!$A:$BU,15,0)),\"\")","v":0},{"$f":"IFERROR((VLOOKUP($A463,DATABASE!$A:$BU,16,0)),\"\")","v":0},{"$f":"IFERROR((VLOOKUP($A463,DATABASE!$A:$BU,17,0)),\"\")","v":0}]
[460,{"$f":"IFERROR((VLOOKUP($A464,DATABASE!$A:$BU,15,0)),\"\")","v":0},{"$f":"IFERROR((VLOOKUP($A464,DATABASE!$A:$BU,16,0)),\"\")","v":0},{"$f":"IFERROR((VLOOKUP($A464,DATABASE!$A:$BU,17,0)),\"\")","v":0}]
[461,{"$f":"IFERROR((VLOOKUP($A465,DATABASE!$A:$BU,15,0)),\"\")","v":0},{"$f":"IFERROR((VLOOKUP($A465,DATABASE!$A:$BU,16,0)),\"\")","v":0},{"$f":"IFERROR((VLOOKUP($A465,DATABASE!$A:$BU,17,0)),\"\")","v":0}]
[462,{"$f":"IFERROR((VLOOKUP($A466,DATABASE!$A:$BU,15,0)),\"\")","v":0},{"$f":"IFERROR((VLOOKUP($A466,DATABASE!$A:$BU,16,0)),\"\")","v":0},{"$f":"IFERROR((VLOOKUP($A466,DATABASE!$A:$BU,17,0)),\"\")","v":0}]
[463,{"$f":"IFERROR((VLOOKUP($A467,DATABASE!$A:$BU,15,0)),\"\")","v":0},{"$f":"IFERROR((VLOOKUP($A467,DATABASE!$A:$BU,16,0)),\"\")","v":0},{"$f":"IFERROR((VLOOKUP($A467,DATABASE!$A:$BU,17,0)),\"\")","v":0}]
[464,{"$f":"IFERROR((VLOOKUP($A468,DATABASE!$A:$BU,15,0)),\"\")","v":0},{"$f":"IFERROR((VLOOKUP($A468,DATABASE!$A:$BU,16,0)),\"\")","v":0},{"$f":"IFERROR((VLOOKUP($A468,DATABASE!$A:$BU,17,0)),\"\")","v":0}]
[465,{"$f":"IFERROR((VLOOKUP($A469,DATABASE!$A:$BU,15,0)),\"\")","v":0},{"$f":"IFERROR((VLOOKUP($A469,DATABASE!$A:$BU,16,0)),\"\")","v":0},{"$f":"IFERROR((VLOOKUP($A469,DATABASE!$A:$BU,17,0)),\"\")","v":0}]
[466,{"$f":"IFERROR((VLOOKUP($A470,DATABASE!$A:$BU,15,0)),\"\")","v":0},{"$f":"IFERROR((VLOOKUP($A470,DATABASE!$A:$BU,16,0)),\"\")","v":0},{"$f":"IFERROR((VLOOKUP($A470,DATABASE!$A:$BU,17,0)),\"\")","v":0}]
[467,{"$f":"IFERROR((VLOOKUP($A471,DATABASE!$A:$BU,15,0)),\"\")","v":0},{"$f":"IFERROR((VLOOKUP($A471,DATABASE!$A:$BU,16,0)),\"\")","v":0},{"$f":"IFERROR((VLOOKUP($A471,DATABASE!$A:$BU,17,0)),\"\")","v":0}]
[468,{"$f":"IFERROR((VLOOKUP($A472,DATABASE!$A:$BU,15,0)),\"\")","v":0},{"$f":"IFERROR((VLOOKUP($A472,DATABASE!$A:$BU,16,0)),\"\")","v":0},{"$f":"IFERROR((VLOOKUP($A472,DATABASE!$A:$BU,17,0)),\"\")","v":0}]
[469,{"$f":"IFERROR((VLOOKUP($A473,DATABASE!$A:$BU,15,0)),\"\")","v":0},{"$f":"IFERROR((VLOOKUP($A473,DATABASE!$A:$BU,16,0)),\"\")","v":0},{"$f":"IFERROR((VLOOKUP($A473,DATABASE!$A:$BU,17,0)),\"\")","v":0}]
[470,{"$f":"IFERROR((VLOOKUP($A474,DATABASE!$A:$BU,15,0)),\"\")","v":0},{"$f":"IFERROR((VLOOKUP($A474,DATABASE!$A:$BU,16,0)),\"\")","v":0},{"$f":"IFERROR((VLOOKUP($A474,DATABASE!$A:$BU,17,0)),\"\")","v":0}]
[471,{"$f":"IFERROR((VLOOKUP($A475,DATABASE!$A:$BU,15,0)),\"\")","v":0},{"$f":"IFERROR((VLOOKUP($A475,DATABASE!$A:$BU,16,0)),\"\")","v":0},{"$f":"IFERROR((VLOOKUP($A475,DATABASE!$A:$BU,17,0)),\"\")","v":0}]
[472,{"$f":"IFERROR((VLOOKUP($A476,DATABASE!$A:$BU,15,0)),\"\")","v":0},{"$f":"IFERROR((VLOOKUP($A476,DATABASE!$A:$BU,16,0)),\"\")","v":0},{"$f":"IFERROR((VLOOKUP($A476,DATABASE!$A:$BU,17,0)),\"\")","v":0}]
[473,{"$f":"IFERROR((VLOOKUP($A477,DATABASE!$A:$BU,15,0)),\"\")","v":0},{"$f":"IFERROR((VLOOKUP($A477,DATABASE!$A:$BU,16,0)),\"\")","v":0},{"$f":"IFERROR((VLOOKUP($A477,DATABASE!$A:$BU,17,0)),\"\")","v":0}]
[474,{"$f":"IFERROR((VLOOKUP($A478,DATABASE!$A:$BU,15,0)),\"\")","v":0},{"$f":"IFERROR((VLOOKUP($A478,DATABASE!$A:$BU,16,0)),\"\")","v":0},{"$f":"IFERROR((VLOOKUP($A478,DATABASE!$A:$BU,17,0)),\"\")","v":0}]
[475,{"$f":"IFERROR((VLOOKUP($A479,DATABASE!$A:$BU,15,0)),\"\")","v":0},{"$f":"IFERROR((VLOOKUP($A479,DATABASE!$A:$BU,16,0)),\"\")","v":0},{"$f":"IFERROR((VLOOKUP($A479,DATABASE!$A:$BU,17,0)),\"\")","v":0}]
[476,{"$f":"IFERROR((VLOOKUP($A480,DATABASE!$A:$BU,15,0)),\"\")","v":0},{"$f":"IFERROR((VLOOKUP($A480,DATABASE!$A:$BU,16,0)),\"\")","v":0},{"$f":"IFERROR((VLOOKUP($A480,DATABASE!$A:$BU,17,0)),\"\")","v":0}]
[477,{"$f":"IFERROR((VLOOKUP($A481,DATABASE!$A:$BU,15,0)),\"\")","v":0},{"$f":"IFERROR((VLOOKUP($A481,DATABASE!$A:$BU,16,0)),\"\")","v":0},{"$f":"IFERROR((VLOOKUP($A481,DATABASE!$A:$BU,17,0)),\"\")","v":0}]
[478,{"$f":"IFERROR((VLOOKUP($A482,DATABASE!$A:$BU,15,0)),\"\")","v":0},{"$f":"IFERROR((VLOOKUP($A482,DATABASE!$A:$BU,16,0)),\"\")","v":0},{"$f":"IFERROR((VLOOKUP($A482,DATABASE!$A:$BU,17,0)),\"\")","v":0}]
[479,{"$f":"IFERROR((VLOOKUP($A483,DATABASE!$A:$BU,15,0)),\"\")","v":0},{"$f":"IFERROR((VLOOKUP($A483,DATABASE!$A:$BU,16,0)),\"\")","v":0},{"$f":"IFERROR((VLOOKUP($A483,DATABASE!$A:$BU,17,0)),\"\")","v":0}]
[480,{"$f":"IFERROR((VLOOKUP($A484,DATABASE!$A:$BU,15,0)),\"\")","v":0},{"$f":"IFERROR((VLOOKUP($A484,DATABASE!$A:$BU,16,0)),\"\")","v":0},{"$f":"IFERROR((VLOOKUP($A484,DATABASE!$A:$BU,17,0)),\"\")","v":0}]
[481,{"$f":"IFERROR((VLOOKUP($A485,DATABASE!$A:$BU,15,0)),\"\")","v":0},{"$f":"IFERROR((VLOOKUP($A485,DATABASE!$A:$BU,16,0)),\"\")","v":0},{"$f":"IFERROR((VLOOKUP($A485,DATABASE!$A:$BU,17,0)),\"\")","v":0}]
[482,{"$f":"IFERROR((VLOOKUP($A486,DATABASE!$A:$BU,15,0)),\"\")","v":0},{"$f":"IFERROR((VLOOKUP($A486,DATABASE!$A:$BU,16,0)),\"\")","v":0},{"$f":"IFERROR((VLOOKUP($A486,DATABASE!$A:$BU,17,0)),\"\")","v":0}]
[483,{"$f":"IFERROR((VLOOKUP($A487,DATABASE!$A:$BU,15,0)),\"\")","v":0},{"$f":"IFERROR((VLOOKUP($A487,DATABASE!$A:$BU,16,0)),\"\")","v":0},{"$f":"IFERROR((VLOOKUP($A487,DATABASE!$A:$BU,17,0)),\"\")","v":0}]
[484,{"$f":"IFERROR((VLOOKUP($A488,DATABASE!$A:$BU,15,0)),\"\")","v":0},{"$f":"IFERROR((VLOOKUP($A488,DATABASE!$A:$BU,16,0)),\"\")","v":0},{"$f":"IFERROR((VLOOKUP($A488,DATABASE!$A:$BU,17,0)),\"\")","v":0}]
[485,{"$f":"IFERROR((VLOOKUP($A489,DATABASE!$A:$BU,15,0)),\"\")","v":0},{"$f":"IFERROR((VLOOKUP($A489,DATABASE!$A:$BU,16,0)),\"\")","v":0},{"$f":"IFERROR((VLOOKUP($A489,DATABASE!$A:$BU,17,0)),\"\")","v":0}]
[486,{"$f":"IFERROR((VLOOKUP($A490,DATABASE!$A:$BU,15,0)),\"\")","v":0},{"$f":"IFERROR((VLOOKUP($A490,DATABASE!$A:$BU,16,0)),\"\")","v":0},{"$f":"IFERROR((VLOOKUP($A490,DATABASE!$A:$BU,17,0)),\"\")","v":0}]
[487,{"$f":"IFERROR((VLOOKUP($A491,DATABASE!$A:$BU,15,0)),\"\")","v":0},{"$f":"IFERROR((VLOOKUP($A491,DATABASE!$A:$BU,16,0)),\"\")","v":0},{"$f":"IFERROR((VLOOKUP($A491,DATABASE!$A:$BU,17,0)),\"\")","v":0}]
[488,{"$f":"IFERROR((VLOOKUP($A492,DATABASE!$A:$BU,15,0)),\"\")","v":0},{"$f":"IFERROR((VLOOKUP($A492,DATABASE!$A:$BU,16,0)),\"\")","v":0},{"$f":"IFERROR((VLOOKUP($A492,DATABASE!$A:$BU,17,0)),\"\")","v":0}]
[489,{"$f":"IFERROR((VLOOKUP($A493,DATABASE!$A:$BU,15,0)),\"\")","v":0},{"$f":"IFERROR((VLOOKUP($A493,DATABASE!$A:$BU,16,0)),\"\")","v":0},{"$f":"IFERROR((VLOOKUP($A493,DATABASE!$A:$BU,17,0)),\"\")","v":0}]
[490,{"$f":"IFERROR((VLOOKUP($A494,DATABASE!$A:$BU,15,0)),\"\")","v":0},{"$f":"IFERROR((VLOOKUP($A494,DATABASE!$A:$BU,16,0)),\"\")","v":0},{"$f":"IFERROR((VLOOKUP($A494,DATABASE!$A:$BU,17,0)),\"\")","v":0}]
[491,{"$f":"IFERROR((VLOOKUP($A495,DATABASE!$A:$BU,15,0)),\"\")","v":0},{"$f":"IFERROR((VLOOKUP($A495,DATABASE!$A:$BU,16,0)),\"\")","v":0},{"$f":"IFERROR((VLOOKUP($A495,DATABASE!$A:$BU,17,0)),\"\")","v":0}]
[492,{"$f":"IFERROR((VLOOKUP($A496,DATABASE!$A:$BU,15,0)),\"\")","v":0},{"$f":"IFERROR((VLOOKUP($A496,DATABASE!$A:$BU,16,0)),\"\")","v":0},{"$f":"IFERROR((VLOOKUP($A496,DATABASE!$A:$BU,17,0)),\"\")","v":0}]
[493,{"$f":"IFERROR((VLOOKUP($A497,DATABASE!$A:$BU,15,0)),\"\")","v":0},{"$f":"IFERROR((VLOOKUP($A497,DATABASE!$A:$BU,16,0)),\"\")","v":0},{"$f":"IFERROR((VLOOKUP($A497,DATABASE!$A:$BU,17,0)),\"\")","v":0}]
[494,{"$f":"IFERROR((VLOOKUP($A498,DATABASE!$A:$BU,15,0)),\"\")","v":0},{"$f":"IFERROR((VLOOKUP($A498,DATABASE!$A:$BU,16,0)),\"\")","v":0},{"$f":"IFERROR((VLOOKUP($A498,DATABASE!$A:$BU,17,0)),\"\")","v":0}]
[495,{"$f":"IFERROR((VLOOKUP($A499,DATABASE!$A:$BU,15,0)),\"\")","v":0},{"$f":"IFERROR((VLOOKUP($A499,DATABASE!$A:$BU,16,0)),\"\")","v":0},{"$f":"IFERROR((VLOOKUP($A499,DATABASE!$A:$BU,17,0)),\"\")","v":0}]
[496,{"$f":"IFERROR((VLOOKUP($A500,DATABASE!$A:$BU,15,0)),\"\")","v":0},{"$f":"IFERROR((VLOOKUP($A500,DATABASE!$A:$BU,16,0)),\"\")","v":0},{"$f":"IFERROR((VLOOKUP($A500,DATABASE!$A:$BU,17,0)),\"\")","v":0}]
[497,{"$f":"IFERROR((VLOOKUP($A501,DATABASE!$A:$BU,15,0)),\"\")","v":0},{"$f":"IFERROR((VLOOKUP($A501,DATABASE!$A:$BU,16,0)),\"\")","v":0},{"$f":"IFERROR((VLOOKUP($A501,DATABASE!$A:$BU,17,0)),\"\")","v":0}]
[498,{"$f":"IFERROR((VLOOKUP($A502,DATABASE!$A:$BU,15,0)),\"\")","v":0},{"$f":"IFERROR((VLOOKUP($A502,DATABASE!$A:$BU,16,0)),\"\")","v":0},{"$f":"IFERROR((VLOOKUP($A502,DATABASE!$A:$BU,17,0)),\"\")","v":0}]
[499,{"$f":"IFERROR((VLOOKUP($A503,DATABASE!$A:$BU,15,0)),\"\")","v":0},{"$f":"IFERROR((VLOOKUP($A503,DATABASE!$A:$BU,16,0)),\"\")","v":0},{"$f":"IFERROR((VLOOKUP($A503,DATABASE!$A:$BU,17,0)),\"\")","v":0}]
[500,{"$f":"IFERROR((VLOOKUP($A504,DATABASE!$A:$BU,15,0)),\"\")","v":0},{"$f":"IFERROR((VLOOKUP($A504,DATABASE!$A:$BU,16,0)),\"\")","v":0},{"$f":"IFERROR((VLOOKUP($A504,DATABASE!$A:$BU,17,0)),\"\")","v":0}]

{"sheet":"Form entry","index":1,"n_rows":73,"n_cols":35,"rows_kept":73,"cut":false,"hidden":true,"merged":[[72,1,72,2],[72,5,72,6],[68,1,68,6],[68,7,68,12],[68,13,68,18],[69,1,69,6],[69,7,69,12],[69,13,69,18],[61,7,61,15],[64,1,64,6],[64,7,64,12],[64,13,64,18],[65,1,65,6],[65,7,65,12],[65,13,65,18],[52,5,52,7],[52,8,52,15],[53,3,53,15],[55,7,55,15],[59,13,59,21],[57,13,57,21],[24,7,24,12],[24,13,24,18],[27,1,27,9],[27,10,27,18],[48,10,48,14],[37,1,37,9],[37,10,37,18],[28,10,28,18],[29,10,29,18],[30,10,30,18],[31,10,31,18],[32,10,32,18],[33,10,33,18],[34,10,34,18],[35,10,35,18],[24,1,24,6],[20,1,20,5],[20,13,20,14],[23,1,23,6],[23,7,23,12],[23,13,23,18],[17,1,17,2],[17,3,17,8],[17,9,17,14],[17,15,17,20],[12,1,12,20],[13,1,13,20],[15,12,15,13],[16,1,16,2],[16,3,16,8],[16,9,16,14],[16,15,16,20],[8,3,8,8],[8,9,8,14],[8,15,8,20],[8,1,8,2],[9,1,9,2],[9,3,9,8],[9,9,9,14],[9,15,9,20],[3,1,3,3],[3,4,3,5],[3,6,3,8],[3,9,3,10],[0,0,0,13],[44,10,44,18],[45,10,45,18],[46,10,46,18],[38,10,38,18],[71,1,71,2],[71,3,71,6],[39,10,39,18],[40,10,40,18],[41,10,41,18],[42,10,42,18],[43,10,43,18],[51,1,51,4],[51,5,51,7],[51,8,51,15],[53,1,53,2],[52,1,52,4]]}
["Data for PAN application 49A",null,null,null,null,null,null,null,null,null,null,null,null,null,null,null,null,null,null,null,null,null,null,null,null,null,null,null,2,null,"EDIT",null,null,null,2]
[]
[null,"Assessing officer (AO code)"]
[null,"Area code",null,null,"AO type",null,"Range Code",null,null,"AO No."]
[]
[]
[null,"1. Full Name "]
[null,"(Full expanded name to be mentioned as appearing in proof of identity/address documents: initials are not permitted)"]
[null,"Title",null,"First Name",null,null,null,null,null,"Middle Name",null,null,null,null,null,"Last Name / Surname"]
[null,"Shri",null,"xyz",null,null,null,null,null,"abc",null,null,null,null,null,"pqr"]
[]
[null,"2. Abbreviation of the above name, as you would like it, to be printed on the PAN card"]
[]
[]
[]
[null,"3. Have you ever been known by any other name?"]
[null,"Title",null,"First Name",null,null,null,null,null,"Middle Name",null,null,null,null,null,"Last Name / Surname"]
[]
[]
[null,"4. Sex (for Individual applicants only)",null,null,null,null,null,null,null,null,null,"5. Date of Birth/Incorporation (DD-MM-YYYY)"]
[]
[]
[null,"6. Father's Name (Only 'Individual' applicants: Even married women should give father's name only)"]
[null,"First Name",null,null,null,null,null,"Middle Name",null,null,null,null,null,"Last Name / Surname"]
[]
[]
[null,"7. Address"]
[null,"Residence Address"]
[null,"Flat/Room/ Door / Block No."]
[null,"Name of Premises/ Building/ Village"]
[null,"Road/Street/ Lane/Post Office"]
[null,"Area / Locality / Taluka/ Sub‐ Division"]
[null,"Town / City / District"]
[null,"State / Union Territory"]
[null,"Pincode / Zip code"]
[null,"Country Name"]
[]
[null,"Office Address"]
[null,"Name of office"]
[null,"Flat/Room/ Door / Block No."]
[null,"Name of Premises/ Building/ Village"]
[null,"Road/Street/ Lane/Post Office"]
[null,"Area / Locality / Taluka/ Sub‐ Division"]
[null,"Town / City / District"]
[null,"State / Union Territory"]
[null,"Pincode / Zip code"]
[null,"Country Name"]
[]
[null,"8. Address for Communication",null,null,null,null,null,null,null,null,"Residence"]
[]
[null,"9. Telephone Number & Email ID details"]
[null,"Country code",null,null,null,"STD Code",null,null,"Telephone Number / Mobile number"]
[]
[null,"Email"]
[]
[null,"10. Status of applicant",null,null,null,null,null,"Individual"]
[]
[null,"11. Registration Number (for company, firms, etc.)"]
[]
[null,"12.Please mention your AADHAAR number (if allotted)"]
[]
[null,"13. Source of Income ",null,null,null,null,null,"Capital Gains"]
[]
[null,"15. Documents submitted"]
[null,"Proof of identity",null,null,null,null,null,"Proof of address",null,null,null,null,null,"Proof of date of birth"]
[]
[]
[null,"16. Signatory Details"]
[null,"I/We (Name)",null,null,null,null,null,"In the Capacity of"]
[]
[]
[null,"Place:"]
[null,"Date:"]

{"sheet":"Sheet1","index":2,"n_rows":66,"n_cols":10,"rows_kept":66,"cut":false,"hidden":true,"merged":[]}
[]
[]
[]
[null,"Sheets(\"Form entry\").Range(\"","B5","\")"," = ","Sheets(\"DATABASE\").Cells(","rowno,",2,")",{"$f":"CONCATENATE(F4,G4,H4,I4,E4,B4,C4,D4)","v":"Sheets(\"DATABASE\").Cells(rowno,2) = Sheets(\"Form entry\").Range(\"B5\")"}]
[null,"Sheets(\"Form entry\").Range(\"","C5","\")"," = ","Sheets(\"DATABASE\").Cells(","rowno,",3,")",{"$f":"CONCATENATE(F5,G5,H5,I5,E5,B5,C5,D5)","v":"Sheets(\"DATABASE\").Cells(rowno,3) = Sheets(\"Form entry\").Range(\"C5\")"}]
[null,"Sheets(\"Form entry\").Range(\"","D5","\")"," = ","Sheets(\"DATABASE\").Cells(","rowno,",4,")","Sheets(\"DATABASE\").Cells(rowno,4) = Sheets(\"Form entry\").Range(\"D5\")"]
[null,"Sheets(\"Form entry\").Range(\"","E5","\")"," = ","Sheets(\"DATABASE\").Cells(","rowno,",5,")","Sheets(\"DATABASE\").Cells(rowno,5) = Sheets(\"Form entry\").Range(\"E5\")"]
[null,"Sheets(\"Form entry\").Range(\"","F5","\")"," = ","Sheets(\"DATABASE\").Cells(","rowno,",6,")","Sheets(\"DATABASE\").Cells(rowno,6) = Sheets(\"Form entry\").Range(\"F5\")"]
[null,"Sheets(\"Form entry\").Range(\"","G5","\")"," = ","Sheets(\"DATABASE\").Cells(","rowno,",7,")","Sheets(\"DATABASE\").Cells(rowno,7) = Sheets(\"Form entry\").Range(\"G5\")"]
[null,"Sheets(\"Form entry\").Range(\"","H5","\")"," = ","Sheets(\"DATABASE\").Cells(","rowno,",8,")","Sheets(\"DATABASE\").Cells(rowno,8) = Sheets(\"Form entry\").Range(\"H5\")"]
[null,"Sheets(\"Form entry\").Range(\"","I5","\")"," = ","Sheets(\"DATABASE\").Cells(","rowno,",9,")","Sheets(\"DATABASE\").Cells(rowno,9) = Sheets(\"Form entry\").Range(\"I5\")"]
[null,"Sheets(\"Form entry\").Range(\"","J5","\")"," = ","Sheets(\"DATABASE\").Cells(","rowno,",10,")","Sheets(\"DATABASE\").Cells(rowno,10) = Sheets(\"Form entry\").Range(\"J5\")"]
[null,"Sheets(\"Form entry\").Range(\"","K5","\")"," = ","Sheets(\"DATABASE\").Cells(","rowno,",11,")","Sheets(\"DATABASE\").Cells(rowno,11) = Sheets(\"Form entry\").Range(\"K5\")"]
[null,"Sheets(\"Form entry\").Range(\"","B10","\")"," = ","Sheets(\"DATABASE\").Cells(","rowno,",14,")","Sheets(\"DATABASE\").Cells(rowno,14) = Sheets(\"Form entry\").Range(\"B10\")"]
[null,"Sheets(\"Form entry\").Range(\"","D10","\")"," = ","Sheets(\"DATABASE\").Cells(","rowno,",15,")","Sheets(\"DATABASE\").Cells(rowno,15) = Sheets(\"Form entry\").Range(\"D10\")"]
[null,"Sheets(\"Form entry\").Range(\"","J10","\")"," = ","Sheets(\"DATABASE\").Cells(","rowno,",16,")","Sheets(\"DATABASE\").Cells(rowno,16) = Sheets(\"Form entry\").Range(\"J10\")"]
[null,"Sheets(\"Form entry\").Range(\"","P10","\")"," = ","Sheets(\"DATABASE\").Cells(","rowno,",17,")","Sheets(\"DATABASE\").Cells(rowno,17) = Sheets(\"Form entry\").Range(\"P10\")"]
[null,"Sheets(\"Form entry\").Range(\"","B13","\")"," = ","Sheets(\"DATABASE\").Cells(","rowno,",18,")","Sheets(\"DATABASE\").Cells(rowno,18) = Sheets(\"Form entry\").Range(\"B13\")"]
[null,"Sheets(\"Form entry\").Range(\"","B14","\")"," = ","Sheets(\"DATABASE\").Cells(","rowno,",19,")","Sheets(\"DATABASE\").Cells(rowno,19) = Sheets(\"Form entry\").Range(\"B14\")"]
[null,"Sheets(\"Form entry\").Range(\"","M16","\")"," = ","Sheets(\"DATABASE\").Cells(","rowno,",20,")","Sheets(\"DATABASE\").Cells(rowno,20) = Sheets(\"Form entry\").Range(\"M16\")"]
[null,"Sheets(\"Form entry\").Range(\"","B18","\")"," = ","Sheets(\"DATABASE\").Cells(","rowno,",21,")","Sheets(\"DATABASE\").Cells(rowno,21) = Sheets(\"Form entry\").Range(\"B18\")"]
[null,"Sheets(\"Form entry\").Range(\"","D18","\")"," = ","Sheets(\"DATABASE\").Cells(","rowno,",22,")","Sheets(\"DATABASE\").Cells(rowno,22) = Sheets(\"Form entry\").Range(\"D18\")"]
[null,"Sheets(\"Form entry\").Range(\"","J18","\")"," = ","Sheets(\"DATABASE\").Cells(","rowno,",23,")","Sheets(\"DATABASE\").Cells(rowno,23) = Sheets(\"Form entry\").Range(\"J18\")"]
[null,"Sheets(\"Form entry\").Range(\"","P18","\")"," = ","Sheets(\"DATABASE\").Cells(","rowno,",24,")","Sheets(\"DATABASE\").Cells(rowno,24) = Sheets(\"Form entry\").Range(\"P18\")"]
[null,"Sheets(\"Form entry\").Range(\"","B21","\")"," = ","Sheets(\"DATABASE\").Cells(","rowno,",26,")","Sheets(\"DATABASE\").Cells(rowno,26) = Sheets(\"Form entry\").Range(\"B21\")"]
[null,"Sheets(\"Form entry\").Range(\"","L21","\")"," = ","Sheets(\"DATABASE\").Cells(","rowno,",27,")","Sheets(\"DATABASE\").Cells(rowno,27) = Sheets(\"Form entry\").Range(\"L21\")"]
[null,"Sheets(\"Form entry\").Range(\"","M21","\")"," = ","Sheets(\"DATABASE\").Cells(","rowno,",28,")","Sheets(\"DATABASE\").Cells(rowno,28) = Sheets(\"Form entry\").Range(\"M21\")"]
[null,"Sheets(\"Form entry\").Range(\"","N21","\")"," = ","Sheets(\"DATABASE\").Cells(","rowno,",29,")","Sheets(\"DATABASE\").Cells(rowno,29) = Sheets(\"Form entry\").Range(\"N21\")"]
[null,"Sheets(\"Form entry\").Range(\"","B25","\")"," = ","Sheets(\"DATABASE\").Cells(","rowno,",30,")","Sheets(\"DATABASE\").Cells(rowno,30) = Sheets(\"Form entry\").Range(\"B25\")"]
[null,"Sheets(\"Form entry\").Range(\"","H25","\")"," = ","Sheets(\"DATABASE\").Cells(","rowno,",31,")","Sheets(\"DATABASE\").Cells(rowno,31) = Sheets(\"Form entry\").Range(\"H25\")"]
[null,"Sheets(\"Form entry\").Range(\"","N25","\")"," = ","Sheets(\"DATABASE\").Cells(","rowno,",32,")","Sheets(\"DATABASE\").Cells(rowno,32) = Sheets(\"Form entry\").Range(\"N25\")"]
[null,"Sheets(\"Form entry\").Range(\"","K29","\")"," = ","Sheets(\"DATABASE\").Cells(","rowno,",34,")","Sheets(\"DATABASE\").Cells(rowno,34) = Sheets(\"Form entry\").Range(\"K29\")"]
[null,"Sheets(\"Form entry\").Range(\"","K30","\")"," = ","Sheets(\"DATABASE\").Cells(","rowno,",35,")","Sheets(\"DATABASE\").Cells(rowno,35) = Sheets(\"Form entry\").Range(\"K30\")"]
[null,"Sheets(\"Form entry\").Range(\"","K31","\")"," = ","Sheets(\"DATABASE\").Cells(","rowno,",36,")","Sheets(\"DATABASE\").Cells(rowno,36) = Sheets(\"Form entry\").Range(\"K31\")"]
[null,"Sheets(\"Form entry\").Range(\"","K32","\")"," = ","Sheets(\"DATABASE\").Cells(","rowno,",37,")","Sheets(\"DATABASE\").Cells(rowno,37) = Sheets(\"Form entry\").Range(\"K32\")"]
[null,"Sheets(\"Form entry\").Range(\"","K33","\")"," = ","Sheets(\"DATABASE\").Cells(","rowno,",38,")","Sheets(\"DATABASE\").Cells(rowno,38) = Sheets(\"Form entry\").Range(\"K33\")"]
[null,"Sheets(\"Form entry\").Range(\"","K34","\")"," = ","Sheets(\"DATABASE\").Cells(","rowno,",39,")","Sheets(\"DATABASE\").Cells(rowno,39) = Sheets(\"Form entry\").Range(\"K34\")"]
[null,"Sheets(\"Form entry\").Range(\"","K35","\")"," = ","Sheets(\"DATABASE\").Cells(","rowno,",40,")","Sheets(\"DATABASE\").Cells(rowno,40) = Sheets(\"Form entry\").Range(\"K35\")"]
[null,"Sheets(\"Form entry\").Range(\"","K36","\")"," = ","Sheets(\"DATABASE\").Cells(","rowno,",41,")","Sheets(\"DATABASE\").Cells(rowno,41) = Sheets(\"Form entry\").Range(\"K36\")"]
[null,"Sheets(\"Form entry\").Range(\"","K39","\")"," = ","Sheets(\"DATABASE\").Cells(","rowno,",42,")","Sheets(\"DATABASE\").Cells(rowno,42) = Sheets(\"Form entry\").Range(\"K39\")"]
[null,"Sheets(\"Form entry\").Range(\"","K40","\")"," = ","Sheets(\"DATABASE\").Cells(","rowno,",43,")","Sheets(\"DATABASE\").Cells(rowno,43) = Sheets(\"Form entry\").Range(\"K40\")"]
[null,"Sheets(\"Form entry\").Range(\"","K41","\")"," = ","Sheets(\"DATABASE\").Cells(","rowno,",44,")","Sheets(\"DATABASE\").Cells(rowno,44) = Sheets(\"Form entry\").Range(\"K41\")"]
[null,"Sheets(\"Form entry\").Range(\"","K42","\")"," = ","Sheets(\"DATABASE\").Cells(","rowno,",45,")","Sheets(\"DATABASE\").Cells(rowno,45) = Sheets(\"Form entry\").Range(\"K42\")"]
[null,"Sheets(\"Form entry\").Range(\"","K43","\")"," = ","Sheets(\"DATABASE\").Cells(","rowno,",46,")","Sheets(\"DATABASE\").Cells(rowno,46) = Sheets(\"Form entry\").Range(\"K43\")"]
[null,"Sheets(\"Form entry\").Range(\"","K44","\")"," = ","Sheets(\"DATABASE\").Cells(","rowno,",47,")","Sheets(\"DATABASE\").Cells(rowno,47) = Sheets(\"Form entry\").Range(\"K44\")"]
[null,"Sheets(\"Form entry\").Range(\"","K45","\")"," = ","Sheets(\"DATABASE\").Cells(","rowno,",48,")","Sheets(\"DATABASE\").Cells(rowno,48) = Sheets(\"Form entry\").Range(\"K45\")"]
[null,"Sheets(\"Form entry\").Range(\"","K46","\")"," = ","Sheets(\"DATABASE\").Cells(","rowno,",49,")","Sheets(\"DATABASE\").Cells(rowno,49) = Sheets(\"Form entry\").Range(\"K46\")"]
[null,"Sheets(\"Form entry\").Range(\"","K47","\")"," = ","Sheets(\"DATABASE\").Cells(","rowno,",50,")","Sheets(\"DATABASE\").Cells(rowno,50) = Sheets(\"Form entry\").Range(\"K47\")"]
[null,"Sheets(\"Form entry\").Range(\"","K49","\")"," = ","Sheets(\"DATABASE\").Cells(","rowno,",51,")","Sheets(\"DATABASE\").Cells(rowno,51) = Sheets(\"Form entry\").Range(\"K49\")"]
[null,"Sheets(\"Form entry\").Range(\"","B53","\")"," = ","Sheets(\"DATABASE\").Cells(","rowno,",52,")","Sheets(\"DATABASE\").Cells(rowno,52) = Sheets(\"Form entry\").Range(\"B53\")"]
[null,"Sheets(\"Form entry\").Range(\"","F53","\")"," = ","Sheets(\"DATABASE\").Cells(","rowno,",53,")","Sheets(\"DATABASE\").Cells(rowno,53) = Sheets(\"Form entry\").Range(\"F53\")"]
[null,"Sheets(\"Form entry\").Range(\"","I53","\")"," = ","Sheets(\"DATABASE\").Cells(","rowno,",54,")","Sheets(\"DATABASE\").Cells(rowno,54) = Sheets(\"Form entry\").Range(\"I53\")"]
[null,"Sheets(\"Form entry\").Range(\"","D54","\")"," = ","Sheets(\"DATABASE\").Cells(","rowno,",55,")","Sheets(\"DATABASE\").Cells(rowno,55) = Sheets(\"Form entry\").Range(\"D54\")"]
[null,"Sheets(\"Form entry\").Range(\"","H56","\")"," = ","Sheets(\"DATABASE\").Cells(","rowno,",56,")","Sheets(\"DATABASE\").Cells(rowno,56) = Sheets(\"Form entry\").Range(\"H56\")"]
[null,"Sheets(\"Form entry\").Range(\"","N58","\")"," = ","Sheets(\"DATABASE\").Cells(","rowno,",57,")","Sheets(\"DATABASE\").Cells(rowno,57) = Sheets(\"Form entry\").Range(\"N58\")"]
[null,"Sheets(\"Form entry\").Range(\"","N60","\")"," = ","Sheets(\"DATABASE\").Cells(","rowno,",58,")","Sheets(\"DATABASE\").Cells(rowno,58) = Sheets(\"Form entry\").Range(\"N60\")"]
[null,"Sheets(\"Form entry\").Range(\"","H62","\")"," = ","Sheets(\"DATABASE\").Cells(","rowno,",60,")","Sheets(\"DATABASE\").Cells(rowno,60) = Sheets(\"Form entry\").Range(\"H62\")"]
[null,"Sheets(\"Form entry\").Range(\"","B66","\")"," = ","Sheets(\"DATABASE\").Cells(","rowno,",61,")","Sheets(\"DATABASE\").Cells(rowno,61) = Sheets(\"Form entry\").Range(\"B66\")"]
[null,"Sheets(\"Form entry\").Range(\"","H66","\")"," = ","Sheets(\"DATABASE\").Cells(","rowno,",62,")","Sheets(\"DATABASE\").Cells(rowno,62) = Sheets(\"Form entry\").Range(\"H66\")"]
[null,"Sheets(\"Form entry\").Range(\"","N66","\")"," = ","Sheets(\"DATABASE\").Cells(","rowno,",63,")","Sheets(\"DATABASE\").Cells(rowno,63) = Sheets(\"Form entry\").Range(\"N66\")"]
[null,"Sheets(\"Form entry\").Range(\"","B70","\")"," = ","Sheets(\"DATABASE\").Cells(","rowno,",64,")","Sheets(\"DATABASE\").Cells(rowno,64) = Sheets(\"Form entry\").Range(\"B70\")"]
[null,"Sheets(\"Form entry\").Range(\"","H70","\")"," = ","Sheets(\"DATABASE\").Cells(","rowno,",65,")","Sheets(\"DATABASE\").Cells(rowno,65) = Sheets(\"Form entry\").Range(\"H70\")"]
[null,"Sheets(\"Form entry\").Range(\"","D72","\")"," = ","Sheets(\"DATABASE\").Cells(","rowno,",66,")","Sheets(\"DATABASE\").Cells(rowno,66) = Sheets(\"Form entry\").Range(\"D72\")"]
[null,"Sheets(\"Form entry\").Range(\"","D73","\")"," = ","Sheets(\"DATABASE\").Cells(","rowno,",67,")","Sheets(\"DATABASE\").Cells(rowno,67) = Sheets(\"Form entry\").Range(\"D73\")"]
[null,"Sheets(\"Form entry\").Range(\"","E73","\")"," = ","Sheets(\"DATABASE\").Cells(","rowno,",68,")","Sheets(\"DATABASE\").Cells(rowno,68) = Sheets(\"Form entry\").Range(\"E73\")"]
[null,"Sheets(\"Form entry\").Range(\"","F73","\")"," = ","Sheets(\"DATABASE\").Cells(","rowno,",69,")","Sheets(\"DATABASE\").Cells(rowno,69) = Sheets(\"Form entry\").Range(\"F73\")"]

{"sheet":"Form 49A","index":3,"n_rows":0,"n_cols":0,"rows_kept":0,"cut":false,"hidden":true,"merged":[]}

{"sheet":"DATABASE","index":4,"n_rows":501,"n_cols":73,"rows_kept":501,"cut":false,"hidden":true,"merged":[[0,63,0,69],[0,19,0,24],[0,29,0,32],[0,33,0,49],[0,51,0,54],[0,57,0,58],[0,60,0,62],[0,26,0,28],[0,17,0,18],[0,1,0,3],[0,4,0,5],[0,6,0,8],[0,9,0,12],[0,13,0,16]]}
["Sl No","Area code",null,null,"AO type",null,"Range Code",null,null,"AO No.",null,null,null,"Point No. 1",null,null,null,"Point No. 2",null,"Point No. 3",null,null,null,null,null,"Point No. 4","Point No. 5",null,null,"Point No. 6",null,null,null,"Point No. 7",null,null,null,null,null,null,null,null,null,null,null,null,null,null,null,null,"Point No. 8","Point No. 9",null,null,null,"Point No. 10","Point No. 11","Point No. 12",null,"Point No. 13","Point No. 15",null,null,"Point No. 16",null,null,null,null,null,null,"Acknowledgment No.","Remark","PAN"]
[1,null,null,null,null,null,null,null,null,null,null,null,null,"Shri","XYX","ABC","HHH","XYZ ABC",null,"Yes","Shri","SSSS",null,"G",null,"Male",20,1,"1905-06-10","ADFASDC","DFASDCF","FFFFF",null,"no. 4, ","5th cross","gayatri tapovana","kottanuru dinne","j p nagar ","karnataka",560078,"india","new office","no. 4, ","5th cross","gayatri tapovana","kottanuru dinne","j p nagar ","karnataka",560078,"india","Residence","91","080","123456789","xyz@abc.com","Individual","regno:123","adhar123",null,"Salary","adhar","address","dob","xyz","individual","bangalore",12,3,2017]
[2,null,null,null,null,null,null,null,null,null,null,null,null,"Shri","xyz","abc","pqr",null,null,null,null,null,null,null,null,null,null,null,null,null,null,null,null,null,null,null,null,null,null,null,null,null,null,null,null,null,null,null,null,null,"Residence",null,null,null,null,"Individual",null,null,null,"Capital Gains"]
[3]
[4]
[5]
[6]
[7]
[8]
[9]
[10]
[11]
[12]
[13]
[14]
[15]
[16]
[17]
[18]
[19]
[20]
[21]
[22]
[23]
[24]
[25]
[26]
[27]
[28]
[29]
[30]
[31]
[32]
[33]
[34]
[35]
[36]
[37]
[38]
[39]
[40]
[41]
[42]
[43]
[44]
[45]
[46]
[47]
[48]
[49]
[50]
[51]
[52]
[53]
[54]
[55]
[56]
[57]
[58]
[59]
[60]
[61]
[62]
[63]
[64]
[65]
[66]
[67]
[68]
[69]
[70]
[71]
[72]
[73]
[74]
[75]
[76]
[77]
[78]
[79]
[80]
[81]
[82]
[83]
[84]
[85]
[86]
[87]
[88]
[89]
[90]
[91]
[92]
[93]
[94]
[95]
[96]
[97]
[98]
[99]
[100]
[101]
[102]
[103]
[104]
[105]
[106]
[107]
[108]
[109]
[110]
[111]
[112]
[113]
[114]
[115]
[116]
[117]
[118]
[119]
[120]
[121]
[122]
[123]
[124]
[125]
[126]
[127]
[128]
[129]
[130]
[131]
[132]
[133]
[134]
[135]
[136]
[137]
[138]
[139]
[140]
[141]
[142]
[143]
[144]
[145]
[146]
[147]
[148]
[149]
[150]
[151]
[152]
[153]
[154]
[155]
[156]
[157]
[158]
[159]
[160]
[161]
[162]
[163]
[164]
[165]
[166]
[167]
[168]
[169]
[170]
[171]
[172]
[173]
[174]
[175]
[176]
[177]
[178]
[179]
[180]
[181]
[182]
[183]
[184]
[185]
[186]
[187]
[188]
[189]
[190]
[191]
[192]
[193]
[194]
[195]
[196]
[197]
[198]
[199]
[200]
[201]
[202]
[203]
[204]
[205]
[206]
[207]
[208]
[209]
[210]
[211]
[212]
[213]
[214]
[215]
[216]
[217]
[218]
[219]
[220]
[221]
[222]
[223]
[224]
[225]
[226]
[227]
[228]
[229]
[230]
[231]
[232]
[233]
[234]
[235]
[236]
[237]
[238]
[239]
[240]
[241]
[242]
[243]
[244]
[245]
[246]
[247]
[248]
[249]
[250]
[251]
[252]
[253]
[254]
[255]
[256]
[257]
[258]
[259]
[260]
[261]
[262]
[263]
[264]
[265]
[266]
[267]
[268]
[269]
[270]
[271]
[272]
[273]
[274]
[275]
[276]
[277]
[278]
[279]
[280]
[281]
[282]
[283]
[284]
[285]
[286]
[287]
[288]
[289]
[290]
[291]
[292]
[293]
[294]
[295]
[296]
[297]
[298]
[299]
[300]
[301]
[302]
[303]
[304]
[305]
[306]
[307]
[308]
[309]
[310]
[311]
[312]
[313]
[314]
[315]
[316]
[317]
[318]
[319]
[320]
[321]
[322]
[323]
[324]
[325]
[326]
[327]
[328]
[329]
[330]
[331]
[332]
[333]
[334]
[335]
[336]
[337]
[338]
[339]
[340]
[341]
[342]
[343]
[344]
[345]
[346]
[347]
[348]
[349]
[350]
[351]
[352]
[353]
[354]
[355]
[356]
[357]
[358]
[359]
[360]
[361]
[362]
[363]
[364]
[365]
[366]
[367]
[368]
[369]
[370]
[371]
[372]
[373]
[374]
[375]
[376]
[377]
[378]
[379]
[380]
[381]
[382]
[383]
[384]
[385]
[386]
[387]
[388]
[389]
[390]
[391]
[392]
[393]
[394]
[395]
[396]
[397]
[398]
[399]
[400]
[401]
[402]
[403]
[404]
[405]
[406]
[407]
[408]
[409]
[410]
[411]
[412]
[413]
[414]
[415]
[416]
[417]
[418]
[419]
[420]
[421]
[422]
[423]
[424]
[425]
[426]
[427]
[428]
[429]
[430]
[431]
[432]
[433]
[434]
[435]
[436]
[437]
[438]
[439]
[440]
[441]
[442]
[443]
[444]
[445]
[446]
[447]
[448]
[449]
[450]
[451]
[452]
[453]
[454]
[455]
[456]
[457]
[458]
[459]
[460]
[461]
[462]
[463]
[464]
[465]
[466]
[467]
[468]
[469]
[470]
[471]
[472]
[473]
[474]
[475]
[476]
[477]
[478]
[479]
[480]
[481]
[482]
[483]
[484]
[485]
[486]
[487]
[488]
[489]
[490]
[491]
[492]
[493]
[494]
[495]
[496]
[497]
[498]
[499]
[500]

{"sheet":"Workings","index":5,"n_rows":149,"n_cols":63,"rows_kept":149,"cut":false,"hidden":true,"merged":[[7,42,7,43],[7,38,7,39],[7,36,7,37],[6,36,6,39],[145,20,145,27],[78,36,78,49],[6,20,6,25],[6,26,6,29],[6,30,6,35],[7,40,7,41],[140,21,140,33],[142,14,142,28],[41,17,41,18],[41,20,41,23],[64,13,64,28],[64,36,64,49],[147,40,148,50],[7,20,7,21],[7,22,7,23],[7,24,7,25],[7,26,7,27],[7,28,7,29],[7,30,7,31],[7,32,7,33],[7,34,7,35],[86,18,86,44],[135,13,135,28],[139,20,139,31],[139,39,139,50],[142,43,142,50],[78,13,78,28],[41,14,41,15],[0,19,0,47],[1,19,1,47],[2,19,2,47],[3,19,3,47],[4,11,4,54]]}
[null,null,null,null,null,null,null,null,null,null,null,null,null,null,null,null,null,null,null,"Form No. 49A"]
[null,null,null,null,null,null,null,null,null,null,null,null,null,null,null,null,null,null,null,"Application for Allotment of Permanent Account Number"]
[null,null,null,null,null,null,null,null,null,null,null,null,null,null,null,null,null,null,null,"Under section 139A of the Income Tax act, 1961"]
[null,null,null,null,null,null,null,null,null,null,null,null,null,null,null,null,null,null,null,"To avoid mistake (s), please follow the accompanying instructions and examples before filling up the form",null,null,null,null,null,null,null,null,null,null,null,null,null,null,null,null,null,null,null,null,null,null,null,null,null,null,null,null,null,null,null,null,null,null,null,null,null,null,null,null,null,"Sl No for New form",7]
[null,null,2,{"$f":"+C5+1","v":3},{"$f":"+D5+1","v":4},5,6,7,null,null,null,null,null,null,null,null,null,null,null,null,null,null,null,null,null,null,null,null,null,null,null,null,null,null,null,null,null,null,null,null,null,null,null,null,null,null,null,null,null,null,null,null,null,null,null,null,null,null,null,null,null,"row no for form edit & update",12345]
[null,null,{"$f":"+H5+1","v":8},{"$f":"+C6+1","v":9},10,11,12,13,null,null,null,null,null,null,null,null,null,null,null,null,"Assessing officer (AO code)",null,null,null,null,null,null,null,null,null,null,null,null,null,null,null,null,null,null,null,null,null,null,null,null,null,null,null,null,null,null,null,null,null,null,null,null,null,null,null,null,"vlookup no for print",1]
[null,null,{"$f":"IF(VLOOKUP($BK$6,DATABASE!$A:$BU,Workings!C5,0)=\"\",\"\",VLOOKUP($BK$6,DATABASE!$A:$BU,Workings!C5,0))","v":""},{"$f":"IF(VLOOKUP($BK$6,DATABASE!$A:$BU,Workings!D5,0)=\"\",\"\",VLOOKUP($BK$6,DATABASE!$A:$BU,Workings!D5,0))","v":""},{"$f":"IF(VLOOKUP($BK$6,DATABASE!$A:$BU,Workings!E5,0)=\"\",\"\",VLOOKUP($BK$6,DATABASE!$A:$BU,Workings!E5,0))","v":""},{"$f":"IF(VLOOKUP($BK$6,DATABASE!$A:$BU,Workings!F5,0)=\"\",\"\",VLOOKUP($BK$6,DATABASE!$A:$BU,Workings!F5,0))","v":""},{"$f":"IF(VLOOKUP($BK$6,DATABASE!$A:$BU,Workings!G5,0)=\"\",\"\",VLOOKUP($BK$6,DATABASE!$A:$BU,Workings!G5,0))","v":""},{"$f":"IF(VLOOKUP($BK$6,DATABASE!$A:$BU,Workings!H5,0)=\"\",\"\",VLOOKUP($BK$6,DATABASE!$A:$BU,Workings!H5,0))","v":""},null,null,null,null,null,null,null,null,null,null,null,null,"Area code",null,null,null,null,null,"AO type",null,null,null,"Range code",null,null,null,null,null,"AO No."]
[null,null,{"$f":"IF(VLOOKUP($BK$6,DATABASE!$A:$BU,Workings!C6,0)=\"\",\"\",VLOOKUP($BK$6,DATABASE!$A:$BU,Workings!C6,0))","v":""},{"$f":"IF(VLOOKUP($BK$6,DATABASE!$A:$BU,Workings!D6,0)=\"\",\"\",VLOOKUP($BK$6,DATABASE!$A:$BU,Workings!D6,0))","v":""},{"$f":"IF(VLOOKUP($BK$6,DATABASE!$A:$BU,Workings!E6,0)=\"\",\"\",VLOOKUP($BK$6,DATABASE!$A:$BU,Workings!E6,0))","v":""},{"$f":"IF(VLOOKUP($BK$6,DATABASE!$A:$BU,Workings!F6,0)=\"\",\"\",VLOOKUP($BK$6,DATABASE!$A:$BU,Workings!F6,0))","v":""},null,null,null,null,null,null,null,null,null,null,null,null,null,null,{"$f":"IF(C7=\"\",\"\",C7)","v":""},null,{"$f":"D7","v":""},null,{"$f":"+E7","v":""},null,{"$f":"+F7","v":""},null,{"$f":"+G7","v":""},null,{"$f":"+H7","v":""},null,{"$f":"+C8","v":""},null,{"$f":"+D8","v":""},null,{"$f":"+E8","v":""},null,{"$f":"+F8","v":""}]
[]
[null,null,null,null,null,null,null,null,null,null,null,null,null,"Sir,",null,null,null,null,null,null,null,null,null,null,null,null,null,null,null,null,null,null,null,null,null,null,null,null,null,null,null,null,null,null,null,null,null,null,null,null,null,null,null,null,null,null,null,null,null,null,null,"Reg Code 1","ATSD-1RI5-1T4Z-123"]
[null,null,null,null,null,null,null,null,null,null,null,null,null,"I/We hereby request that a permanent account number be allotted to me/us.",null,null,null,null,null,null,null,null,null,null,null,null,null,null,null,null,null,null,null,null,null,null,null,null,null,null,null,null,null,null,null,null,null,null,null,null,null,null,null,null,null,null,null,null,null,null,null,"Reg Code 2",{"$f":"Home!G3","v":0}]
[null,null,null,null,null,null,null,null,null,null,null,null,null,"I/We give below necessary particulars:"]
[]
[null,null,null,null,null,null,null,null,null,null,null,null,1,"Full Name (Full expanded name to be mentioned as appearing in proof of identity/address documents: initials are not permitted)",null,null,null,null,null,null,null,null,null,null,null,null,null,null,null,null,null,null,null,null,null,null,null,null,null,null,null,null,null,null,null,null,null,null,null,null,null,null,null,null,null,null,null,null,null,null,null,null,{"$f":"IF(BK10=BK11,\"Registered\",\"Not Registered\")","v":"Not Registered"}]
[null,null,{"$f":"IF(VLOOKUP($BK$6,DATABASE!$A:$BU,Workings!I15,0)=\"\",\"\",VLOOKUP($BK$6,DATABASE!$A:$BU,Workings!I15,0))","v":"Shri"},null,null,null,null,null,14,null,null,null,null,"Please select title,",null,null,null,null,null,"P","as applicable",null,null,null,null,{"$f":"IF(SHR=AT15,\"P\",\"\")","v":"P"},null,null,null,{"$f":"IF(SHR=AU15,\"P\",\"\")","v":""},null,null,null,{"$f":"IF(SHR=AV15,\"P\",\"\")","v":""},null,null,null,{"$f":"IF(SHR=AM15,\"P\",\"\")","v":""},"M/s",null,null,null,null,null,null,"Shri","Smt.","Kumari"]
[]
[null,null,{"$f":"IF(VLOOKUP($BK$6,DATABASE!$A:$BU,Workings!I17,0)=\"\",\"\",VLOOKUP($BK$6,DATABASE!$A:$BU,Workings!I17,0))","v":"HHH"},null,null,null,null,null,17,null,null,null,null,"Last Name / Surname",null,null,null,null,null,null,{"$f":"UPPER(MID(Name_3,1,1))","v":"H"},{"$f":"UPPER(MID(Name_3,2,1))","v":"H"},{"$f":"UPPER(MID(Name_3,3,1))","v":"H"},{"$f":"UPPER(MID(Name_3,4,1))","v":""},{"$f":"UPPER(MID(Name_3,5,1))","v":""},{"$f":"UPPER(MID(Name_3,6,1))","v":""},{"$f":"UPPER(MID(Name_3,7,1))","v":""},{"$f":"UPPER(MID(Name_3,8,1))","v":""},{"$f":"UPPER(MID(Name_3,9,1))","v":""},{"$f":"UPPER(MID(Name_3,10,1))","v":""},{"$f":"UPPER(MID(Name_3,11,1))","v":""},{"$f":"UPPER(MID(Name_3,12,1))","v":""},{"$f":"UPPER(MID(Name_3,13,1))","v":""},{"$f":"UPPER(MID(Name_3,14,1))","v":""},{"$f":"UPPER(MID(Name_3,15,1))","v":""},{"$f":"UPPER(MID(Name_3,16,1))","v":""},{"$f":"UPPER(MID(Name_3,17,1))","v":""},{"$f":"UPPER(MID(Name_3,18,1))","v":""},{"$f":"UPPER(MID(Name_3,19,1))","v":""},{"$f":"UPPER(MID(Name_3,20,1))","v":""},{"$f":"UPPER(MID(Name_3,21,1))","v":""},{"$f":"UPPER(MID(Name_3,22,1))","v":""},{"$f":"UPPER(MID(Name_3,23,1))","v":""},{"$f":"UPPER(MID(Name_3,24,1))","v":""},{"$f":"UPPER(MID(Name_3,25,1))","v":""}]
[]
[null,null,{"$f":"IF(VLOOKUP($BK$6,DATABASE!$A:$BU,Workings!I19,0)=\"\",\"\",VLOOKUP($BK$6,DATABASE!$A:$BU,Workings!I19,0))","v":"XYX"},null,null,null,null,null,15,null,null,null,null,"First Name",null,null,null,null,null,null,{"$f":"UPPER(MID(Name_1,1,1))","v":"X"},{"$f":"UPPER(MID(Name_1,2,1))","v":"Y"},{"$f":"UPPER(MID(Name_1,3,1))","v":"X"},{"$f":"UPPER(MID(Name_1,4,1))","v":""},{"$f":"UPPER(MID(Name_1,5,1))","v":""},{"$f":"UPPER(MID(Name_1,6,1))","v":""},{"$f":"UPPER(MID(Name_1,7,1))","v":""},{"$f":"UPPER(MID(Name_1,8,1))","v":""},{"$f":"UPPER(MID(Name_1,9,1))","v":""},{"$f":"UPPER(MID(Name_1,10,1))","v":""},{"$f":"UPPER(MID(Name_1,11,1))","v":""},{"$f":"UPPER(MID(Name_1,12,1))","v":""},{"$f":"UPPER(MID(Name_1,13,1))","v":""},{"$f":"UPPER(MID(Name_1,14,1))","v":""},{"$f":"UPPER(MID(Name_1,15,1))","v":""},{"$f":"UPPER(MID(Name_1,16,1))","v":""},{"$f":"UPPER(MID(Name_1,17,1))","v":""},{"$f":"UPPER(MID(Name_1,18,1))","v":""},{"$f":"UPPER(MID(Name_1,19,1))","v":""},{"$f":"UPPER(MID(Name_1,20,1))","v":""},{"$f":"UPPER(MID(Name_1,21,1))","v":""},{"$f":"UPPER(MID(Name_1,22,1))","v":""},{"$f":"UPPER(MID(Name_1,23,1))","v":""},{"$f":"UPPER(MID(Name_1,24,1))","v":""},{"$f":"UPPER(MID(Name_1,25,1))","v":""}]
[]
[null,null,{"$f":"IF(VLOOKUP($BK$6,DATABASE!$A:$BU,Workings!I21,0)=\"\",\"\",VLOOKUP($BK$6,DATABASE!$A:$BU,Workings!I21,0))","v":"ABC"},null,null,null,null,null,16,null,null,null,null,"Middle Name",null,null,null,null,null,null,{"$f":"UPPER(MID(Name_2,1,1))","v":"A"},{"$f":"UPPER(MID(Name_2,2,1))","v":"B"},{"$f":"UPPER(MID(Name_2,3,1))","v":"C"},{"$f":"UPPER(MID(Name_2,4,1))","v":""},{"$f":"UPPER(MID(Name_2,5,1))","v":""},{"$f":"UPPER(MID(Name_2,6,1))","v":""},{"$f":"UPPER(MID(Name_2,7,1))","v":""},{"$f":"UPPER(MID(Name_2,8,1))","v":""},{"$f":"UPPER(MID(Name_2,9,1))","v":""},{"$f":"UPPER(MID(Name_2,10,1))","v":""},{"$f":"UPPER(MID(Name_2,11,1))","v":""},{"$f":"UPPER(MID(Name_2,12,1))","v":""},{"$f":"UPPER(MID(Name_2,13,1))","v":""},{"$f":"UPPER(MID(Name_2,14,1))","v":""},{"$f":"UPPER(MID(Name_2,15,1))","v":""},{"$f":"UPPER(MID(Name_2,16,1))","v":""},{"$f":"UPPER(MID(Name_2,17,1))","v":""},{"$f":"UPPER(MID(Name_2,18,1))","v":""},{"$f":"UPPER(MID(Name_2,19,1))","v":""},{"$f":"UPPER(MID(Name_2,20,1))","v":""},{"$f":"UPPER(MID(Name_2,21,1))","v":""},{"$f":"UPPER(MID(Name_2,22,1))","v":""},{"$f":"UPPER(MID(Name_2,23,1))","v":""},{"$f":"UPPER(MID(Name_2,24,1))","v":""},{"$f":"UPPER(MID(Name_2,25,1))","v":""}]
[]
[null,null,null,null,null,null,null,null,null,null,null,null,2,"Abbreviation of the above name, as you would like it, to be printed on the PAN card"]
[null,null,null,null,null,null,null,null,null,null,null,null,null,1,2,3,4,5,6,7,8,9,10,11,12,13,14,15,16,17,18,19,20,21,22,23,24,25,26,27,28,29,30,31,32,33,34,35,36,37,38]
[null,null,{"$f":"IF(VLOOKUP($BK$6,DATABASE!$A:$BU,Workings!I25,0)=\"\",\"\",VLOOKUP($BK$6,DATABASE!$A:$BU,Workings!I25,0))","v":"XYZ ABC"},null,null,null,null,null,18,null,null,null,null,{"$f":"UPPER(MID(Pname,N24,1))","v":"X"},{"$f":"UPPER(MID(Pname,O24,1))","v":"Y"},"Z"," ","A","B","C","","","","","","","","","","","","","","","","","","","","","","","","","","","","","","",""]
[null,null,{"$f":"IF(VLOOKUP($BK$6,DATABASE!$A:$BU,Workings!I26,0)=\"\",\"\",VLOOKUP($BK$6,DATABASE!$A:$BU,Workings!I26,0))","v":""},null,null,null,null,null,19,null,null,null,null,{"$f":"UPPER(MID(Pname1,N24,1))","v":""},"","","","","","","","","","","","","","","","","","","","","","","","","","","","","","","","","","","","",""]
[]
[null,null,{"$f":"IF(VLOOKUP($BK$6,DATABASE!$A:$BU,Workings!I28,0)=\"\",\"\",VLOOKUP($BK$6,DATABASE!$A:$BU,Workings!I28,0))","v":"Yes"},null,null,null,null,null,20,null,null,null,3,"Have you ever been known by any other name?",null,null,null,null,null,null,null,null,null,null,null,null,null,null,null,{"$f":"IF(OTHNAME=\"Yes\",\"P\",\"\")","v":"P"},null,null,null,{"$f":"IF(OTHNAME=\"No\",\"P\",\"\")","v":""},"No",null,null,"Yes",null,null,null,null,null,"(Please tick as applicable)",null,null,null,null,null,null,null,null,null,null,null,null,null,null,null,null,null,""]
[null,null,null,null,null,null,null,null,null,null,null,null,null,"If yes, please give that other name"]
[]
[null,null,{"$f":"IF(VLOOKUP($BK$6,DATABASE!$A:$BU,Workings!I31,0)=\"\",\"\",VLOOKUP($BK$6,DATABASE!$A:$BU,Workings!I31,0))","v":"Shri"},null,null,null,null,null,21,null,null,null,null,"Please select title,",null,null,null,null,null,"P","as applicable",null,null,null,null,{"$f":"IF(SHRO=AP31,\"P\",\"\")","v":"P"},null,null,null,{"$f":"IF(SHRO=AR31,\"P\",\"\")","v":""},null,null,null,{"$f":"IF(SHRO=AT31,\"P\",\"\")","v":""},null,null,null,{"$f":"IF(SHRO=AM31,\"P\",\"\")","v":""},"M/s",null,null,"Shri",null,"Smt.",null,"Kumari"]
[]
[null,null,{"$f":"IF(VLOOKUP($BK$6,DATABASE!$A:$BU,Workings!I33,0)=\"\",\"\",VLOOKUP($BK$6,DATABASE!$A:$BU,Workings!I33,0))","v":"G"},null,null,null,null,null,24,null,null,null,null,"Last Name / Surname",null,null,null,null,null,null,{"$f":"UPPER(MID(Oname_3,1,1))","v":"G"},{"$f":"UPPER(MID(Oname_3,2,1))","v":""},{"$f":"UPPER(MID(Oname_3,3,1))","v":""},{"$f":"UPPER(MID(Oname_3,4,1))","v":""},{"$f":"UPPER(MID(Oname_3,5,1))","v":""},{"$f":"UPPER(MID(Oname_3,6,1))","v":""},{"$f":"UPPER(MID(Oname_3,7,1))","v":""},{"$f":"UPPER(MID(Oname_3,8,1))","v":""},{"$f":"UPPER(MID(Oname_3,9,1))","v":""},{"$f":"UPPER(MID(Oname_3,10,1))","v":""},{"$f":"UPPER(MID(Oname_3,11,1))","v":""},{"$f":"UPPER(MID(Oname_3,12,1))","v":""},{"$f":"UPPER(MID(Oname_3,13,1))","v":""},{"$f":"UPPER(MID(Oname_3,14,1))","v":""},{"$f":"UPPER(MID(Oname_3,15,1))","v":""},{"$f":"UPPER(MID(Oname_3,16,1))","v":""},{"$f":"UPPER(MID(Oname_3,17,1))","v":""},{"$f":"UPPER(MID(Oname_3,18,1))","v":""},{"$f":"UPPER(MID(Oname_3,19,1))","v":""},{"$f":"UPPER(MID(Oname_3,20,1))","v":""},{"$f":"UPPER(MID(Oname_3,21,1))","v":""},{"$f":"UPPER(MID(Oname_3,22,1))","v":""},{"$f":"UPPER(MID(Oname_3,23,1))","v":""},{"$f":"UPPER(MID(Oname_3,24,1))","v":""},{"$f":"UPPER(MID(Oname_3,25,1))","v":""}]
[]
[null,null,{"$f":"IF(VLOOKUP($BK$6,DATABASE!$A:$BU,Workings!I35,0)=\"\",\"\",VLOOKUP($BK$6,DATABASE!$A:$BU,Workings!I35,0))","v":"SSSS"},null,null,null,null,null,22,null,null,null,null,"First Name",null,null,null,null,null,null,{"$f":"UPPER(MID(Oname_1,1,1))","v":"S"},{"$f":"UPPER(MID(Oname_1,2,1))","v":"S"},{"$f":"UPPER(MID(Oname_1,3,1))","v":"S"},{"$f":"UPPER(MID(Oname_1,4,1))","v":"S"},{"$f":"UPPER(MID(Oname_1,5,1))","v":""},{"$f":"UPPER(MID(Oname_1,6,1))","v":""},{"$f":"UPPER(MID(Oname_1,7,1))","v":""},{"$f":"UPPER(MID(Oname_1,8,1))","v":""},{"$f":"UPPER(MID(Oname_1,9,1))","v":""},{"$f":"UPPER(MID(Oname_1,10,1))","v":""},{"$f":"UPPER(MID(Oname_1,11,1))","v":""},{"$f":"UPPER(MID(Oname_1,12,1))","v":""},{"$f":"UPPER(MID(Oname_1,13,1))","v":""},{"$f":"UPPER(MID(Oname_1,14,1))","v":""},{"$f":"UPPER(MID(Oname_1,15,1))","v":""},{"$f":"UPPER(MID(Oname_1,16,1))","v":""},{"$f":"UPPER(MID(Oname_1,17,1))","v":""},{"$f":"UPPER(MID(Oname_1,18,1))","v":""},{"$f":"UPPER(MID(Oname_1,19,1))","v":""},{"$f":"UPPER(MID(Oname_1,20,1))","v":""},{"$f":"UPPER(MID(Oname_1,21,1))","v":""},{"$f":"UPPER(MID(Oname_1,22,1))","v":""},{"$f":"UPPER(MID(Oname_1,23,1))","v":""},{"$f":"UPPER(MID(Oname_1,24,1))","v":""},{"$f":"UPPER(MID(Oname_1,25,1))","v":""}]
[]
[null,null,{"$f":"IF(VLOOKUP($BK$6,DATABASE!$A:$BU,Workings!I37,0)=\"\",\"\",VLOOKUP($BK$6,DATABASE!$A:$BU,Workings!I37,0))","v":""},null,null,null,null,null,23,null,null,null,null,"Middle Name",null,null,null,null,null,null,{"$f":"UPPER(MID(Oname_2,1,1))","v":""},{"$f":"UPPER(MID(Oname_2,2,1))","v":""},{"$f":"UPPER(MID(Oname_2,3,1))","v":""},{"$f":"UPPER(MID(Oname_2,4,1))","v":""},{"$f":"UPPER(MID(Oname_2,5,1))","v":""},{"$f":"UPPER(MID(Oname_2,6,1))","v":""},{"$f":"UPPER(MID(Oname_2,7,1))","v":""},{"$f":"UPPER(MID(Oname_2,8,1))","v":""},{"$f":"UPPER(MID(Oname_2,9,1))","v":""},{"$f":"UPPER(MID(Oname_2,10,1))","v":""},{"$f":"UPPER(MID(Oname_2,11,1))","v":""},{"$f":"UPPER(MID(Oname_2,12,1))","v":""},{"$f":"UPPER(MID(Oname_2,13,1))","v":""},{"$f":"UPPER(MID(Oname_2,14,1))","v":""},{"$f":"UPPER(MID(Oname_2,15,1))","v":""},{"$f":"UPPER(MID(Oname_2,16,1))","v":""},{"$f":"UPPER(MID(Oname_2,17,1))","v":""},{"$f":"UPPER(MID(Oname_2,18,1))","v":""},{"$f":"UPPER(MID(Oname_2,19,1))","v":""},{"$f":"UPPER(MID(Oname_2,20,1))","v":""},{"$f":"UPPER(MID(Oname_2,21,1))","v":""},{"$f":"UPPER(MID(Oname_2,22,1))","v":""},{"$f":"UPPER(MID(Oname_2,23,1))","v":""},{"$f":"UPPER(MID(Oname_2,24,1))","v":""},{"$f":"UPPER(MID(Oname_2,25,1))","v":""}]
[]
[null,null,{"$f":"IF(VLOOKUP($BK$6,DATABASE!$A:$BU,Workings!I39,0)=\"\",\"\",VLOOKUP($BK$6,DATABASE!$A:$BU,Workings!I39,0))","v":"Male"},null,null,null,null,null,26,null,null,null,4,"Sex (for Individual applicants only)",null,null,null,null,null,null,null,null,null,null,null,null,null,null,{"$f":"IF(SEX=\"Male\",\"P\",\"\")","v":"P"},null,null,null,{"$f":"IF(SEX=\"Female\",\"P\",\"\")","v":""},"Female",null,null,null,"Male",null,null,null,null,null,"(Please tick as applicable)"]
[]
[null,null,null,null,null,null,null,null,null,null,null,null,5,"Date of Birth/Incorporation/Agreement/Partnership or Trust Deed/ Formation of Body of individuals or association of Persons"]
[null,null,null,null,null,null,null,null,null,null,null,null,null,null,"Day",null,null,"Month",null,null,"Year"]
[null,null,{"$f":"DATE(IF(VLOOKUP($BK$6,DATABASE!$A:$BU,29,0)=\"\",\"\",VLOOKUP($BK$6,DATABASE!$A:$BU,29,0)),IF(VLOOKUP($BK$6,DATABASE!$A:$BU,28,0)=\"\",\"\",VLOOKUP($BK$6,DATABASE!$A:$BU,28,0)),IF(VLOOKUP($BK$6,DATABASE!$A:$BU,Workings!I43,0)=\"\",\"\",VLOOKUP($BK$6,DATABASE!$A:$BU,Workings!I43,0)))","v":"1988-01-20"},null,null,null,null,null,27,null,null,null,null,null,{"$f":"IFERROR(MID(TEXT(DAY(DATE1),\"dd\"),1,1),\"\")","v":"2"},{"$f":"IFERROR(MID(TEXT(DAY(DATE1),\"dd\"),2,1),\"\")","v":"0"},null,{"$f":"IFERROR(MID(TEXT(MONTH(DATE1),\"dd\"),1,1),\"\")","v":"0"},{"$f":"IFERROR(MID(TEXT(MONTH(DATE1),\"dd\"),2,1),\"\")","v":"1"},null,{"$f":"IFERROR(MID((YEAR(DATE1)),1,1),\"\")","v":"1"},{"$f":"IFERROR(MID((YEAR(DATE1)),2,1),\"\")","v":"9"},{"$f":"IFERROR(MID((YEAR(DATE1)),3,1),\"\")","v":"8"},{"$f":"IFERROR(MID((YEAR(DATE1)),4,1),\"\")","v":"8"}]
[]
[null,null,null,null,null,null,null,null,null,null,null,null,6,"Father's Name (Only 'Individual' applicants: Even married women should give father's name only)"]
[]
[null,null,{"$f":"IF(VLOOKUP($BK$6,DATABASE!$A:$BU,Workings!I47,0)=\"\",\"\",VLOOKUP($BK$6,DATABASE!$A:$BU,Workings!I47,0))","v":"FFFFF"},null,null,null,null,null,32,null,null,null,null,"Last Name / Surname",null,null,null,null,null,null,{"$f":"UPPER(MID(Fname_3,1,1))","v":"F"},{"$f":"UPPER(MID(Fname_3,2,1))","v":"F"},{"$f":"UPPER(MID(Fname_3,3,1))","v":"F"},{"$f":"UPPER(MID(Fname_3,4,1))","v":"F"},{"$f":"UPPER(MID(Fname_3,5,1))","v":"F"},{"$f":"UPPER(MID(Fname_3,6,1))","v":""},{"$f":"UPPER(MID(Fname_3,7,1))","v":""},{"$f":"UPPER(MID(Fname_3,8,1))","v":""},{"$f":"UPPER(MID(Fname_3,9,1))","v":""},{"$f":"UPPER(MID(Fname_3,10,1))","v":""},{"$f":"UPPER(MID(Fname_3,11,1))","v":""},{"$f":"UPPER(MID(Fname_3,12,1))","v":""},{"$f":"UPPER(MID(Fname_3,13,1))","v":""},{"$f":"UPPER(MID(Fname_3,14,1))","v":""},{"$f":"UPPER(MID(Fname_3,15,1))","v":""},{"$f":"UPPER(MID(Fname_3,16,1))","v":""},{"$f":"UPPER(MID(Fname_3,17,1))","v":""},{"$f":"UPPER(MID(Fname_3,18,1))","v":""},{"$f":"UPPER(MID(Fname_3,19,1))","v":""},{"$f":"UPPER(MID(Fname_3,20,1))","v":""},{"$f":"UPPER(MID(Fname_3,21,1))","v":""},{"$f":"UPPER(MID(Fname_3,22,1))","v":""},{"$f":"UPPER(MID(Fname_3,23,1))","v":""},{"$f":"UPPER(MID(Fname_3,24,1))","v":""},{"$f":"UPPER(MID(Fname_3,25,1))","v":""}]
[]
[null,null,{"$f":"IF(VLOOKUP($BK$6,DATABASE!$A:$BU,Workings!I49,0)=\"\",\"\",VLOOKUP($BK$6,DATABASE!$A:$BU,Workings!I49,0))","v":"ADFASDC"},null,null,null,null,null,30,null,null,null,null,"First Name",null,null,null,null,null,null,{"$f":"UPPER(MID(Fname_1,1,1))","v":"A"},{"$f":"UPPER(MID(Fname_1,2,1))","v":"D"},{"$f":"UPPER(MID(Fname_1,3,1))","v":"F"},{"$f":"UPPER(MID(Fname_1,4,1))","v":"A"},{"$f":"UPPER(MID(Fname_1,5,1))","v":"S"},{"$f":"UPPER(MID(Fname_1,6,1))","v":"D"},{"$f":"UPPER(MID(Fname_1,7,1))","v":"C"},{"$f":"UPPER(MID(Fname_1,8,1))","v":""},{"$f":"UPPER(MID(Fname_1,9,1))","v":""},{"$f":"UPPER(MID(Fname_1,10,1))","v":""},{"$f":"UPPER(MID(Fname_1,11,1))","v":""},{"$f":"UPPER(MID(Fname_1,12,1))","v":""},{"$f":"UPPER(MID(Fname_1,13,1))","v":""},{"$f":"UPPER(MID(Fname_1,14,1))","v":""},{"$f":"UPPER(MID(Fname_1,15,1))","v":""},{"$f":"UPPER(MID(Fname_1,16,1))","v":""},{"$f":"UPPER(MID(Fname_1,17,1))","v":""},{"$f":"UPPER(MID(Fname_1,18,1))","v":""},{"$f":"UPPER(MID(Fname_1,19,1))","v":""},{"$f":"UPPER(MID(Fname_1,20,1))","v":""},{"$f":"UPPER(MID(Fname_1,21,1))","v":""},{"$f":"UPPER(MID(Fname_1,22,1))","v":""},{"$f":"UPPER(MID(Fname_1,23,1))","v":""},{"$f":"UPPER(MID(Fname_1,24,1))","v":""},{"$f":"UPPER(MID(Fname_1,25,1))","v":""}]
[]
[null,null,{"$f":"IF(VLOOKUP($BK$6,DATABASE!$A:$BU,Workings!I51,0)=\"\",\"\",VLOOKUP($BK$6,DATABASE!$A:$BU,Workings!I51,0))","v":"DFASDCF"},null,null,null,null,null,31,null,null,null,null,"Middle Name",null,null,null,null,null,null,{"$f":"UPPER(MID(Fname_2,1,1))","v":"D"},{"$f":"UPPER(MID(Fname_2,2,1))","v":"F"},{"$f":"UPPER(MID(Fname_2,3,1))","v":"A"},{"$f":"UPPER(MID(Fname_2,4,1))","v":"S"},{"$f":"UPPER(MID(Fname_2,5,1))","v":"D"},{"$f":"UPPER(MID(Fname_2,6,1))","v":"C"},{"$f":"UPPER(MID(Fname_2,7,1))","v":"F"},{"$f":"UPPER(MID(Fname_2,8,1))","v":""},{"$f":"UPPER(MID(Fname_2,9,1))","v":""},{"$f":"UPPER(MID(Fname_2,10,1))","v":""},{"$f":"UPPER(MID(Fname_2,11,1))","v":""},{"$f":"UPPER(MID(Fname_2,12,1))","v":""},{"$f":"UPPER(MID(Fname_2,13,1))","v":""},{"$f":"UPPER(MID(Fname_2,14,1))","v":""},{"$f":"UPPER(MID(Fname_2,15,1))","v":""},{"$f":"UPPER(MID(Fname_2,16,1))","v":""},{"$f":"UPPER(MID(Fname_2,17,1))","v":""},{"$f":"UPPER(MID(Fname_2,18,1))","v":""},{"$f":"UPPER(MID(Fname_2,19,1))","v":""},{"$f":"UPPER(MID(Fname_2,20,1))","v":""},{"$f":"UPPER(MID(Fname_2,21,1))","v":""},{"$f":"UPPER(MID(Fname_2,22,1))","v":""},{"$f":"UPPER(MID(Fname_2,23,1))","v":""},{"$f":"UPPER(MID(Fname_2,24,1))","v":""},{"$f":"UPPER(MID(Fname_2,25,1))","v":""}]
[]
[null,null,null,null,null,null,null,null,null,null,null,null,7,"Address"]
[null,null,null,null,null,null,null,null,null,null,null,null,null,"Residence Address"]
[null,null,{"$f":"IF(VLOOKUP($BK$6,DATABASE!$A:$BU,Workings!I55,0)=\"\",\"\",VLOOKUP($BK$6,DATABASE!$A:$BU,Workings!I55,0))","v":"no. 4, "},null,null,null,null,null,34,null,null,null,null,"Flat/Room/ Door / Block No.",null,null,null,null,null,null,null,null,null,null,null,{"$f":"UPPER(MID(_RA1,1,1))","v":"N"},{"$f":"UPPER(MID(_RA1,2,1))","v":"O"},{"$f":"UPPER(MID(_RA1,3,1))","v":"."},{"$f":"UPPER(MID(_RA1,4,1))","v":" "},{"$f":"UPPER(MID(_RA1,5,1))","v":"4"},{"$f":"UPPER(MID(_RA1,6,1))","v":","},{"$f":"UPPER(MID(_RA1,7,1))","v":" "},{"$f":"UPPER(MID(_RA1,8,1))","v":""},{"$f":"UPPER(MID(_RA1,9,1))","v":""},{"$f":"UPPER(MID(_RA1,10,1))","v":""},{"$f":"UPPER(MID(_RA1,11,1))","v":""},{"$f":"UPPER(MID(_RA1,12,1))","v":""},{"$f":"UPPER(MID(_RA1,13,1))","v":""},{"$f":"UPPER(MID(_RA1,14,1))","v":""},{"$f":"UPPER(MID(_RA1,15,1))","v":""},{"$f":"UPPER(MID(_RA1,16,1))","v":""},{"$f":"UPPER(MID(_RA1,17,1))","v":""},{"$f":"UPPER(MID(_RA1,18,1))","v":""},{"$f":"UPPER(MID(_RA1,19,1))","v":""},{"$f":"UPPER(MID(_RA1,20,1))","v":""},{"$f":"UPPER(MID(_RA1,21,1))","v":""},{"$f":"UPPER(MID(_RA1,22,1))","v":""},{"$f":"UPPER(MID(_RA1,23,1))","v":""},{"$f":"UPPER(MID(_RA1,24,1))","v":""},{"$f":"UPPER(MID(_RA1,25,1))","v":""}]
[]
[null,null,{"$f":"IF(VLOOKUP($BK$6,DATABASE!$A:$BU,Workings!I57,0)=\"\",\"\",VLOOKUP($BK$6,DATABASE!$A:$BU,Workings!I57,0))","v":"5th cross"},null,null,null,null,null,35,null,null,null,null,"Name of Premises/ Building/ Village",null,null,null,null,null,null,null,null,null,null,null,{"$f":"UPPER(MID(_RA2,1,1))","v":"5"},{"$f":"UPPER(MID(_RA2,2,1))","v":"T"},{"$f":"UPPER(MID(_RA2,3,1))","v":"H"},{"$f":"UPPER(MID(_RA2,4,1))","v":" "},{"$f":"UPPER(MID(_RA2,5,1))","v":"C"},{"$f":"UPPER(MID(_RA2,6,1))","v":"R"},{"$f":"UPPER(MID(_RA2,7,1))","v":"O"},{"$f":"UPPER(MID(_RA2,8,1))","v":"S"},{"$f":"UPPER(MID(_RA2,9,1))","v":"S"},{"$f":"UPPER(MID(_RA2,10,1))","v":""},{"$f":"UPPER(MID(_RA2,11,1))","v":""},{"$f":"UPPER(MID(_RA2,12,1))","v":""},{"$f":"UPPER(MID(_RA2,13,1))","v":""},{"$f":"UPPER(MID(_RA2,14,1))","v":""},{"$f":"UPPER(MID(_RA2,15,1))","v":""},{"$f":"UPPER(MID(_RA2,16,1))","v":""},{"$f":"UPPER(MID(_RA2,17,1))","v":""},{"$f":"UPPER(MID(_RA2,18,1))","v":""},{"$f":"UPPER(MID(_RA2,19,1))","v":""},{"$f":"UPPER(MID(_RA2,20,1))","v":""},{"$f":"UPPER(MID(_RA2,21,1))","v":""},{"$f":"UPPER(MID(_RA2,22,1))","v":""},{"$f":"UPPER(MID(_RA2,23,1))","v":""},{"$f":"UPPER(MID(_RA2,24,1))","v":""},{"$f":"UPPER(MID(_RA2,25,1))","v":""}]
[]
[null,null,{"$f":"IF(VLOOKUP($BK$6,DATABASE!$A:$BU,Workings!I59,0)=\"\",\"\",VLOOKUP($BK$6,DATABASE!$A:$BU,Workings!I59,0))","v":"gayatri tapovana"},null,null,null,null,null,36,null,null,null,null,"Road/Street/ Lane/Post Office",null,null,null,null,null,null,null,null,null,null,null,{"$f":"UPPER(MID(_RA3,1,1))","v":"G"},{"$f":"UPPER(MID(_RA3,2,1))","v":"A"},{"$f":"UPPER(MID(_RA3,3,1))","v":"Y"},{"$f":"UPPER(MID(_RA3,4,1))","v":"A"},{"$f":"UPPER(MID(_RA3,5,1))","v":"T"},{"$f":"UPPER(MID(_RA3,6,1))","v":"R"},{"$f":"UPPER(MID(_RA3,7,1))","v":"I"},{"$f":"UPPER(MID(_RA3,8,1))","v":" "},{"$f":"UPPER(MID(_RA3,9,1))","v":"T"},{"$f":"UPPER(MID(_RA3,10,1))","v":"A"},{"$f":"UPPER(MID(_RA3,11,1))","v":"P"},{"$f":"UPPER(MID(_RA3,12,1))","v":"O"},{"$f":"UPPER(MID(_RA3,13,1))","v":"V"},{"$f":"UPPER(MID(_RA3,14,1))","v":"A"},{"$f":"UPPER(MID(_RA3,15,1))","v":"N"},{"$f":"UPPER(MID(_RA3,16,1))","v":"A"},{"$f":"UPPER(MID(_RA3,17,1))","v":""},{"$f":"UPPER(MID(_RA3,18,1))","v":""},{"$f":"UPPER(MID(_RA3,19,1))","v":""},{"$f":"UPPER(MID(_RA3,20,1))","v":""},{"$f":"UPPER(MID(_RA3,21,1))","v":""},{"$f":"UPPER(MID(_RA3,22,1))","v":""},{"$f":"UPPER(MID(_RA3,23,1))","v":""},{"$f":"UPPER(MID(_RA3,24,1))","v":""},{"$f":"UPPER(MID(_RA3,25,1))","v":""}]
[]
[null,null,{"$f":"IF(VLOOKUP($BK$6,DATABASE!$A:$BU,Workings!I61,0)=\"\",\"\",VLOOKUP($BK$6,DATABASE!$A:$BU,Workings!I61,0))","v":"kottanuru dinne"},null,null,null,null,null,37,null,null,null,null,"Area / Locality / Taluka/ Sub‐ Division",null,null,null,null,null,null,null,null,null,null,null,{"$f":"UPPER(MID(_RA4,1,1))","v":"K"},{"$f":"UPPER(MID(_RA4,2,1))","v":"O"},{"$f":"UPPER(MID(_RA4,3,1))","v":"T"},{"$f":"UPPER(MID(_RA4,4,1))","v":"T"},{"$f":"UPPER(MID(_RA4,5,1))","v":"A"},{"$f":"UPPER(MID(_RA4,6,1))","v":"N"},{"$f":"UPPER(MID(_RA4,7,1))","v":"U"},{"$f":"UPPER(MID(_RA4,8,1))","v":"R"},{"$f":"UPPER(MID(_RA4,9,1))","v":"U"},{"$f":"UPPER(MID(_RA4,10,1))","v":" "},{"$f":"UPPER(MID(_RA4,11,1))","v":"D"},{"$f":"UPPER(MID(_RA4,12,1))","v":"I"},{"$f":"UPPER(MID(_RA4,13,1))","v":"N"},{"$f":"UPPER(MID(_RA4,14,1))","v":"N"},{"$f":"UPPER(MID(_RA4,15,1))","v":"E"},{"$f":"UPPER(MID(_RA4,16,1))","v":""},{"$f":"UPPER(MID(_RA4,17,1))","v":""},{"$f":"UPPER(MID(_RA4,18,1))","v":""},{"$f":"UPPER(MID(_RA4,19,1))","v":""},{"$f":"UPPER(MID(_RA4,20,1))","v":""},{"$f":"UPPER(MID(_RA4,21,1))","v":""},{"$f":"UPPER(MID(_RA4,22,1))","v":""},{"$f":"UPPER(MID(_RA4,23,1))","v":""},{"$f":"UPPER(MID(_RA4,24,1))","v":""},{"$f":"UPPER(MID(_RA4,25,1))","v":""}]
[]
[null,null,{"$f":"IF(VLOOKUP($BK$6,DATABASE!$A:$BU,Workings!I63,0)=\"\",\"\",VLOOKUP($BK$6,DATABASE!$A:$BU,Workings!I63,0))","v":"j p nagar "},null,null,null,null,null,38,null,null,null,null,"Town / City / District",null,null,null,null,null,null,null,null,null,null,null,{"$f":"UPPER(MID(_RA5,1,1))","v":"J"},{"$f":"UPPER(MID(_RA5,2,1))","v":" "},{"$f":"UPPER(MID(_RA5,3,1))","v":"P"},{"$f":"UPPER(MID(_RA5,4,1))","v":" "},{"$f":"UPPER(MID(_RA5,5,1))","v":"N"},{"$f":"UPPER(MID(_RA5,6,1))","v":"A"},{"$f":"UPPER(MID(_RA5,7,1))","v":"G"},{"$f":"UPPER(MID(_RA5,8,1))","v":"A"},{"$f":"UPPER(MID(_RA5,9,1))","v":"R"},{"$f":"UPPER(MID(_RA5,10,1))","v":" "},{"$f":"UPPER(MID(_RA5,11,1))","v":""},{"$f":"UPPER(MID(_RA5,12,1))","v":""},{"$f":"UPPER(MID(_RA5,13,1))","v":""},{"$f":"UPPER(MID(_RA5,14,1))","v":""},{"$f":"UPPER(MID(_RA5,15,1))","v":""},{"$f":"UPPER(MID(_RA5,16,1))","v":""},{"$f":"UPPER(MID(_RA5,17,1))","v":""},{"$f":"UPPER(MID(_RA5,18,1))","v":""},{"$f":"UPPER(MID(_RA5,19,1))","v":""},{"$f":"UPPER(MID(_RA5,20,1))","v":""},{"$f":"UPPER(MID(_RA5,21,1))","v":""},{"$f":"UPPER(MID(_RA5,22,1))","v":""},{"$f":"UPPER(MID(_RA5,23,1))","v":""},{"$f":"UPPER(MID(_RA5,24,1))","v":""},{"$f":"UPPER(MID(_RA5,25,1))","v":""}]
[null,null,{"$f":"IF(VLOOKUP($BK$6,DATABASE!$A:$BU,Workings!I64,0)=\"\",\"\",VLOOKUP($BK$6,DATABASE!$A:$BU,Workings!I64,0))","v":"karnataka"},null,null,null,null,null,39,null,null,null,null,"State / Union Territory",null,null,null,null,null,null,null,null,null,null,null,null,null,null,null,"Pincode / Zip code",null,null,null,null,null,null,"Country Name"]
[null,null,{"$f":"IF(VLOOKUP($BK$6,DATABASE!$A:$BU,Workings!I65,0)=\"\",\"\",VLOOKUP($BK$6,DATABASE!$A:$BU,Workings!I65,0))","v":560078},null,null,null,null,null,40,null,null,null,null,{"$f":"UPPER(_RA6)","v":"KARNATAKA"},null,null,null,null,null,null,null,null,null,null,null,null,null,null,null,{"$f":"UPPER(MID(_RA7,1,1))","v":"5"},{"$f":"UPPER(MID(_RA7,2,1))","v":"6"},{"$f":"UPPER(MID(_RA7,3,1))","v":"0"},{"$f":"UPPER(MID(_RA7,4,1))","v":"0"},{"$f":"UPPER(MID(_RA7,5,1))","v":"7"},{"$f":"UPPER(MID(_RA7,6,1))","v":"8"},null,{"$f":"UPPER(_RA8)","v":"INDIA"}]
[null,null,{"$f":"IF(VLOOKUP($BK$6,DATABASE!$A:$BU,Workings!I66,0)=\"\",\"\",VLOOKUP($BK$6,DATABASE!$A:$BU,Workings!I66,0))","v":"india"},null,null,null,null,null,41,null,null,null,null,"Office Address"]
[null,null,{"$f":"IF(VLOOKUP($BK$6,DATABASE!$A:$BU,Workings!I67,0)=\"\",\"\",VLOOKUP($BK$6,DATABASE!$A:$BU,Workings!I67,0))","v":"new office"},null,null,null,null,null,42,null,null,null,null,"Name of office",null,null,null,null,null,null,null,null,null,null,null,{"$f":"UPPER(MID(__OA1,1,1))","v":"N"},{"$f":"UPPER(MID(__OA1,2,1))","v":"E"},{"$f":"UPPER(MID(__OA1,3,1))","v":"W"},{"$f":"UPPER(MID(__OA1,4,1))","v":" "},{"$f":"UPPER(MID(__OA1,5,1))","v":"O"},{"$f":"UPPER(MID(__OA1,6,1))","v":"F"},{"$f":"UPPER(MID(__OA1,7,1))","v":"F"},{"$f":"UPPER(MID(__OA1,8,1))","v":"I"},{"$f":"UPPER(MID(__OA1,9,1))","v":"C"},{"$f":"UPPER(MID(__OA1,10,1))","v":"E"},{"$f":"UPPER(MID(__OA1,11,1))","v":""},{"$f":"UPPER(MID(__OA1,12,1))","v":""},{"$f":"UPPER(MID(__OA1,13,1))","v":""},{"$f":"UPPER(MID(__OA1,14,1))","v":""},{"$f":"UPPER(MID(__OA1,15,1))","v":""},{"$f":"UPPER(MID(__OA1,16,1))","v":""},{"$f":"UPPER(MID(__OA1,17,1))","v":""},{"$f":"UPPER(MID(__OA1,18,1))","v":""},{"$f":"UPPER(MID(__OA1,19,1))","v":""},{"$f":"UPPER(MID(__OA1,20,1))","v":""},{"$f":"UPPER(MID(__OA1,21,1))","v":""},{"$f":"UPPER(MID(__OA1,22,1))","v":""},{"$f":"UPPER(MID(__OA1,23,1))","v":""},{"$f":"UPPER(MID(__OA1,24,1))","v":""},{"$f":"UPPER(MID(__OA1,25,1))","v":""}]
[]
[null,null,{"$f":"IF(VLOOKUP($BK$6,DATABASE!$A:$BU,Workings!I69,0)=\"\",\"\",VLOOKUP($BK$6,DATABASE!$A:$BU,Workings!I69,0))","v":"no. 4, "},null,null,null,null,null,43,null,null,null,null,"Flat/Room/ Door / Block No.",null,null,null,null,null,null,null,null,null,null,null,{"$f":"UPPER(MID(__OA2,1,1))","v":"N"},{"$f":"UPPER(MID(__OA2,2,1))","v":"O"},{"$f":"UPPER(MID(__OA2,3,1))","v":"."},{"$f":"UPPER(MID(__OA2,4,1))","v":" "},{"$f":"UPPER(MID(__OA2,5,1))","v":"4"},{"$f":"UPPER(MID(__OA2,6,1))","v":","},{"$f":"UPPER(MID(__OA2,7,1))","v":" "},{"$f":"UPPER(MID(__OA2,8,1))","v":""},{"$f":"UPPER(MID(__OA2,9,1))","v":""},{"$f":"UPPER(MID(__OA2,10,1))","v":""},{"$f":"UPPER(MID(__OA2,11,1))","v":""},{"$f":"UPPER(MID(__OA2,12,1))","v":""},{"$f":"UPPER(MID(__OA2,13,1))","v":""},{"$f":"UPPER(MID(__OA2,14,1))","v":""},{"$f":"UPPER(MID(__OA2,15,1))","v":""},{"$f":"UPPER(MID(__OA2,16,1))","v":""},{"$f":"UPPER(MID(__OA2,17,1))","v":""},{"$f":"UPPER(MID(__OA2,18,1))","v":""},{"$f":"UPPER(MID(__OA2,19,1))","v":""},{"$f":"UPPER(MID(__OA2,20,1))","v":""},{"$f":"UPPER(MID(__OA2,21,1))","v":""},{"$f":"UPPER(MID(__OA2,22,1))","v":""},{"$f":"UPPER(MID(__OA2,23,1))","v":""},{"$f":"UPPER(MID(__OA2,24,1))","v":""},{"$f":"UPPER(MID(__OA2,25,1))","v":""}]
[]
[null,null,{"$f":"IF(VLOOKUP($BK$6,DATABASE!$A:$BU,Workings!I71,0)=\"\",\"\",VLOOKUP($BK$6,DATABASE!$A:$BU,Workings!I71,0))","v":"5th cross"},null,null,null,null,null,44,null,null,null,null,"Name of Premises/ Building/ Village",null,null,null,null,null,null,null,null,null,null,null,{"$f":"UPPER(MID(__OA3,1,1))","v":"5"},{"$f":"UPPER(MID(__OA3,2,1))","v":"T"},{"$f":"UPPER(MID(__OA3,3,1))","v":"H"},{"$f":"UPPER(MID(__OA3,4,1))","v":" "},{"$f":"UPPER(MID(__OA3,5,1))","v":"C"},{"$f":"UPPER(MID(__OA3,6,1))","v":"R"},{"$f":"UPPER(MID(__OA3,7,1))","v":"O"},{"$f":"UPPER(MID(__OA3,8,1))","v":"S"},{"$f":"UPPER(MID(__OA3,9,1))","v":"S"},{"$f":"UPPER(MID(__OA3,10,1))","v":""},{"$f":"UPPER(MID(__OA3,11,1))","v":""},{"$f":"UPPER(MID(__OA3,12,1))","v":""},{"$f":"UPPER(MID(__OA3,13,1))","v":""},{"$f":"UPPER(MID(__OA3,14,1))","v":""},{"$f":"UPPER(MID(__OA3,15,1))","v":""},{"$f":"UPPER(MID(__OA3,16,1))","v":""},{"$f":"UPPER(MID(__OA3,17,1))","v":""},{"$f":"UPPER(MID(__OA3,18,1))","v":""},{"$f":"UPPER(MID(__OA3,19,1))","v":""},{"$f":"UPPER(MID(__OA3,20,1))","v":""},{"$f":"UPPER(MID(__OA3,21,1))","v":""},{"$f":"UPPER(MID(__OA3,22,1))","v":""},{"$f":"UPPER(MID(__OA3,23,1))","v":""},{"$f":"UPPER(MID(__OA3,24,1))","v":""},{"$f":"UPPER(MID(__OA3,25,1))","v":""}]
[]
[null,null,{"$f":"IF(VLOOKUP($BK$6,DATABASE!$A:$BU,Workings!I73,0)=\"\",\"\",VLOOKUP($BK$6,DATABASE!$A:$BU,Workings!I73,0))","v":"gayatri tapovana"},null,null,null,null,null,45,null,null,null,null,"Road/Street/ Lane/Post Office",null,null,null,null,null,null,null,null,null,null,null,{"$f":"UPPER(MID(__OA4,1,1))","v":"G"},{"$f":"UPPER(MID(__OA4,2,1))","v":"A"},{"$f":"UPPER(MID(__OA4,3,1))","v":"Y"},{"$f":"UPPER(MID(__OA4,4,1))","v":"A"},{"$f":"UPPER(MID(__OA4,5,1))","v":"T"},{"$f":"UPPER(MID(__OA4,6,1))","v":"R"},{"$f":"UPPER(MID(__OA4,7,1))","v":"I"},{"$f":"UPPER(MID(__OA4,8,1))","v":" "},{"$f":"UPPER(MID(__OA4,9,1))","v":"T"},{"$f":"UPPER(MID(__OA4,10,1))","v":"A"},{"$f":"UPPER(MID(__OA4,11,1))","v":"P"},{"$f":"UPPER(MID(__OA4,12,1))","v":"O"},{"$f":"UPPER(MID(__OA4,13,1))","v":"V"},{"$f":"UPPER(MID(__OA4,14,1))","v":"A"},{"$f":"UPPER(MID(__OA4,15,1))","v":"N"},{"$f":"UPPER(MID(__OA4,16,1))","v":"A"},{"$f":"UPPER(MID(__OA4,17,1))","v":""},{"$f":"UPPER(MID(__OA4,18,1))","v":""},{"$f":"UPPER(MID(__OA4,19,1))","v":""},{"$f":"UPPER(MID(__OA4,20,1))","v":""},{"$f":"UPPER(MID(__OA4,21,1))","v":""},{"$f":"UPPER(MID(__OA4,22,1))","v":""},{"$f":"UPPER(MID(__OA4,23,1))","v":""},{"$f":"UPPER(MID(__OA4,24,1))","v":""},{"$f":"UPPER(MID(__OA4,25,1))","v":""}]
[]
[null,null,{"$f":"IF(VLOOKUP($BK$6,DATABASE!$A:$BU,Workings!I75,0)=\"\",\"\",VLOOKUP($BK$6,DATABASE!$A:$BU,Workings!I75,0))","v":"kottanuru dinne"},null,null,null,null,null,46,null,null,null,null,"Area / Locality / Taluka/ Sub‐ Division",null,null,null,null,null,null,null,null,null,null,null,{"$f":"UPPER(MID(__OA5,1,1))","v":"K"},{"$f":"UPPER(MID(__OA5,2,1))","v":"O"},{"$f":"UPPER(MID(__OA5,3,1))","v":"T"},{"$f":"UPPER(MID(__OA5,4,1))","v":"T"},{"$f":"UPPER(MID(__OA5,5,1))","v":"A"},{"$f":"UPPER(MID(__OA5,6,1))","v":"N"},{"$f":"UPPER(MID(__OA5,7,1))","v":"U"},{"$f":"UPPER(MID(__OA5,8,1))","v":"R"},{"$f":"UPPER(MID(__OA5,9,1))","v":"U"},{"$f":"UPPER(MID(__OA5,10,1))","v":" "},{"$f":"UPPER(MID(__OA5,11,1))","v":"D"},{"$f":"UPPER(MID(__OA5,12,1))","v":"I"},{"$f":"UPPER(MID(__OA5,13,1))","v":"N"},{"$f":"UPPER(MID(__OA5,14,1))","v":"N"},{"$f":"UPPER(MID(__OA5,15,1))","v":"E"},{"$f":"UPPER(MID(__OA5,16,1))","v":""},{"$f":"UPPER(MID(__OA5,17,1))","v":""},{"$f":"UPPER(MID(__OA5,18,1))","v":""},{"$f":"UPPER(MID(__OA5,19,1))","v":""},{"$f":"UPPER(MID(__OA5,20,1))","v":""},{"$f":"UPPER(MID(__OA5,21,1))","v":""},{"$f":"UPPER(MID(__OA5,22,1))","v":""},{"$f":"UPPER(MID(__OA5,23,1))","v":""},{"$f":"UPPER(MID(__OA5,24,1))","v":""},{"$f":"UPPER(MID(__OA5,25,1))","v":""}]
[]
[null,null,{"$f":"IF(VLOOKUP($BK$6,DATABASE!$A:$BU,Workings!I77,0)=\"\",\"\",VLOOKUP($BK$6,DATABASE!$A:$BU,Workings!I77,0))","v":"j p nagar "},null,null,null,null,null,47,null,null,null,null,"Town / City / District",null,null,null,null,null,null,null,null,null,null,null,{"$f":"UPPER(MID(__OA6,1,1))","v":"J"},{"$f":"UPPER(MID(__OA6,2,1))","v":" "},{"$f":"UPPER(MID(__OA6,3,1))","v":"P"},{"$f":"UPPER(MID(__OA6,4,1))","v":" "},{"$f":"UPPER(MID(__OA6,5,1))","v":"N"},{"$f":"UPPER(MID(__OA6,6,1))","v":"A"},{"$f":"UPPER(MID(__OA6,7,1))","v":"G"},{"$f":"UPPER(MID(__OA6,8,1))","v":"A"},{"$f":"UPPER(MID(__OA6,9,1))","v":"R"},{"$f":"UPPER(MID(__OA6,10,1))","v":" "},{"$f":"UPPER(MID(__OA6,11,1))","v":""},{"$f":"UPPER(MID(__OA6,12,1))","v":""},{"$f":"UPPER(MID(__OA6,13,1))","v":""},{"$f":"UPPER(MID(__OA6,14,1))","v":""},{"$f":"UPPER(MID(__OA6,15,1))","v":""},{"$f":"UPPER(MID(__OA6,16,1))","v":""},{"$f":"UPPER(MID(__OA6,17,1))","v":""},{"$f":"UPPER(MID(__OA6,18,1))","v":""},{"$f":"UPPER(MID(__OA6,19,1))","v":""},{"$f":"UPPER(MID(__OA6,20,1))","v":""},{"$f":"UPPER(MID(__OA6,21,1))","v":""},{"$f":"UPPER(MID(__OA6,22,1))","v":""},{"$f":"UPPER(MID(__OA6,23,1))","v":""},{"$f":"UPPER(MID(__OA6,24,1))","v":""},{"$f":"UPPER(MID(__OA6,25,1))","v":""}]
[null,null,{"$f":"IF(VLOOKUP($BK$6,DATABASE!$A:$BU,Workings!I78,0)=\"\",\"\",VLOOKUP($BK$6,DATABASE!$A:$BU,Workings!I78,0))","v":"karnataka"},null,null,null,null,null,48,null,null,null,null,"State / Union Territory",null,null,null,null,null,null,null,null,null,null,null,null,null,null,null,"Pincode / Zip code",null,null,null,null,null,null,"Country Name"]
[null,null,{"$f":"IF(VLOOKUP($BK$6,DATABASE!$A:$BU,Workings!I79,0)=\"\",\"\",VLOOKUP($BK$6,DATABASE!$A:$BU,Workings!I79,0))","v":560078},null,null,null,null,null,49,null,null,null,null,{"$f":"UPPER(__OA7)","v":"KARNATAKA"},null,null,null,null,null,null,null,null,null,null,null,null,null,null,null,{"$f":"UPPER(MID(__OA8,1,1))","v":"5"},{"$f":"UPPER(MID(__OA8,2,1))","v":"6"},{"$f":"UPPER(MID(__OA8,3,1))","v":"0"},{"$f":"UPPER(MID(__OA8,4,1))","v":"0"},{"$f":"UPPER(MID(__OA8,5,1))","v":"7"},{"$f":"UPPER(MID(__OA8,6,1))","v":"8"},null,{"$f":"IF(__OA7<>\"\",\"INDIA\",\"\")","v":"INDIA"}]
[]
[null,null,{"$f":"IF(VLOOKUP($BK$6,DATABASE!$A:$BU,Workings!I81,0)=\"\",\"\",VLOOKUP($BK$6,DATABASE!$A:$BU,Workings!I81,0))","v":"Residence"},null,null,null,null,null,51,null,null,null,8,"Address for Communication",null,null,null,null,null,null,null,null,null,null,null,null,null,null,null,{"$f":"IF(ADDC=AM81,\"P\",\"\")","v":"P"},null,null,null,null,null,{"$f":"IF(ADDC=AK81,\"P\",\"\")","v":""},"Office",null,"Residence",null,null,"(Please tick as applicable)"]
[null,null,{"$f":"IF(VLOOKUP($BK$6,DATABASE!$A:$BU,Workings!I82,0)=\"\",\"\",VLOOKUP($BK$6,DATABASE!$A:$BU,Workings!I82,0))","v":"91"},null,null,null,null,null,52]
[null,null,{"$f":"IF(VLOOKUP($BK$6,DATABASE!$A:$BU,Workings!I83,0)=\"\",\"\",VLOOKUP($BK$6,DATABASE!$A:$BU,Workings!I83,0))","v":"080"},null,null,null,null,null,53,null,null,null,9,"Telephone Number & Email ID details"]
[null,null,{"$f":"IF(VLOOKUP($BK$6,DATABASE!$A:$BU,Workings!I84,0)=\"\",\"\",VLOOKUP($BK$6,DATABASE!$A:$BU,Workings!I84,0))","v":"123456789"},null,null,null,null,null,54,null,null,null,null,null,null,null,null,null,"Country code",null,null,null,"STD Code",null,null,null,null,null,null,null,"Telephone Number / Mobile number"]
[null,null,null,null,null,null,null,null,null,null,null,null,null,null,null,null,null,null,{"$f":"UPPER(MID(CC,1,1))","v":"9"},{"$f":"UPPER(MID(CC,2,1))","v":"1"},{"$f":"UPPER(MID(CC,3,1))","v":""},null,{"$f":"UPPER(MID(STD,1,1))","v":"0"},{"$f":"UPPER(MID(STD,2,1))","v":"8"},{"$f":"UPPER(MID(STD,3,1))","v":"0"},{"$f":"UPPER(MID(STD,4,1))","v":""},{"$f":"UPPER(MID(STD,5,1))","v":""},{"$f":"UPPER(MID(STD,6,1))","v":""},{"$f":"UPPER(MID(STD,7,1))","v":""},null,{"$f":"UPPER(MID(PH,1,1))","v":"1"},{"$f":"UPPER(MID(PH,2,1))","v":"2"},{"$f":"UPPER(MID(PH,3,1))","v":"3"},{"$f":"UPPER(MID(PH,4,1))","v":"4"},{"$f":"UPPER(MID(PH,5,1))","v":"5"},{"$f":"UPPER(MID(PH,6,1))","v":"6"},{"$f":"UPPER(MID(PH,7,1))","v":"7"},{"$f":"UPPER(MID(PH,8,1))","v":"8"},{"$f":"UPPER(MID(PH,9,1))","v":"9"},{"$f":"UPPER(MID(PH,10,1))","v":""},{"$f":"UPPER(MID(PH,11,1))","v":""},{"$f":"UPPER(MID(PH,12,1))","v":""},{"$f":"UPPER(MID(PH,13,1))","v":""}]
[]
[null,null,{"$f":"IF(VLOOKUP($BK$6,DATABASE!$A:$BU,Workings!I87,0)=\"\",\"\",VLOOKUP($BK$6,DATABASE!$A:$BU,Workings!I87,0))","v":"xyz@abc.com"},null,null,null,null,null,55,null,null,null,null,"Email ID",null,null,null,null,{"$f":"LOWER(EMAIL)","v":"xyz@abc.com"}]
[]
[null,null,null,null,null,null,null,null,null,null,null,null,10,"Status of applicant"]
[]
[null,null,{"$f":"IF(VLOOKUP($BK$6,DATABASE!$A:$BU,Workings!I91,0)=\"\",\"\",VLOOKUP($BK$6,DATABASE!$A:$BU,Workings!I91,0))","v":"Individual"},null,null,null,null,null,56,null,null,null,null,null,null,null,null,null,null,null,null,null,null,null,null,null,null,null,null,null,null,null,null,null,null,null,null,null,null,null,null,null,null,null,null,{"$f":"IF(STATUS=AU91,\"P\",\"\")","v":""},"Government",null,null,null,null,null,null,null,null,null,"Individual",null,"Hindu undivided family",null,null,"Company","Partnership Firm"]
[]
[null,null,null,null,null,null,null,null,null,null,null,null,{"$f":"IF(STATUS=BE91,\"P\",\"\")","v":"P"},null,null,null,null,null,null,null,null,{"$f":"IF(STATUS=BG91,\"P\",\"\")","v":""},null,null,null,null,null,null,null,{"$f":"IF(STATUS=BJ91,\"P\",\"\")","v":""},null,null,null,null,null,{"$f":"IF(STATUS=BK91,\"P\",\"\")","v":""},null,null,null,null,null,null,null,null,null,{"$f":"IF(STATUS=AU93,\"P\",\"\")","v":""},"Association of Persons",null,null,null,null,null,null,null,null,null,"Trusts",null,"Body of Individuals",null,null,"Local Authority","Artificial Juridical Persons"]
[]
[null,null,null,null,null,null,null,null,null,null,null,null,{"$f":"IF(STATUS=BE93,\"P\",\"\")","v":""},null,null,null,null,null,null,null,null,{"$f":"IF(STATUS=BG93,\"P\",\"\")","v":""},null,null,null,null,null,null,null,{"$f":"IF(STATUS=BJ93,\"P\",\"\")","v":""},null,null,null,null,null,{"$f":"IF(STATUS=BK93,\"P\",\"\")","v":""},null,null,null,null,null,null,null,null,null,{"$f":"IF(STATUS=AU95,\"P\",\"\")","v":""},"Limited Liability Partnership"]
[]
[null,null,null,null,null,null,null,null,null,null,null,null,11,"Registration Number (for company, firms, etc.)"]
[null,null,{"$f":"IF(VLOOKUP($BK$6,DATABASE!$A:$BU,Workings!I98,0)=\"\",\"\",VLOOKUP($BK$6,DATABASE!$A:$BU,Workings!I98,0))","v":"regno:123"},null,null,null,null,null,57,null,null,null,null,{"$f":"UPPER(MID(RN,1,1))","v":"R"},{"$f":"UPPER(MID(RN,2,1))","v":"E"},{"$f":"UPPER(MID(RN,3,1))","v":"G"},{"$f":"UPPER(MID(RN,4,1))","v":"N"},{"$f":"UPPER(MID(RN,5,1))","v":"O"},{"$f":"UPPER(MID(RN,6,1))","v":":"},{"$f":"UPPER(MID(RN,7,1))","v":"1"},{"$f":"UPPER(MID(RN,8,1))","v":"2"},{"$f":"UPPER(MID(RN,9,1))","v":"3"},{"$f":"UPPER(MID(RN,10,1))","v":""},{"$f":"UPPER(MID(RN,11,1))","v":""},{"$f":"UPPER(MID(RN,12,1))","v":""},{"$f":"UPPER(MID(RN,13,1))","v":""},{"$f":"UPPER(MID(RN,14,1))","v":""},{"$f":"UPPER(MID(RN,15,1))","v":""},{"$f":"UPPER(MID(RN,16,1))","v":""},{"$f":"UPPER(MID(RN,17,1))","v":""},{"$f":"UPPER(MID(RN,18,1))","v":""},{"$f":"UPPER(MID(RN,19,1))","v":""},{"$f":"UPPER(MID(RN,20,1))","v":""},{"$f":"UPPER(MID(RN,21,1))","v":""},{"$f":"UPPER(MID(RN,22,1))","v":""},{"$f":"UPPER(MID(RN,23,1))","v":""},{"$f":"UPPER(MID(RN,24,1))","v":""},{"$f":"UPPER(MID(RN,25,1))","v":""},{"$f":"UPPER(MID(RN,26,1))","v":""},{"$f":"UPPER(MID(RN,27,1))","v":""},{"$f":"UPPER(MID(RN,28,1))","v":""},{"$f":"UPPER(MID(RN,29,1))","v":""},{"$f":"UPPER(MID(RN,30,1))","v":""},{"$f":"UPPER(MID(RN,31,1))","v":""}]
[]
[null,null,{"$f":"IF(VLOOKUP($BK$6,DATABASE!$A:$BU,Workings!I100,0)=\"\",\"\",VLOOKUP($BK$6,DATABASE!$A:$BU,Workings!I100,0))","v":{"$error":"#VALUE!"}},null,null,null,null,null,null,null,null,null,12,"Whether citizen of India?",null,null,null,null,null,null,null,null,null,null,null,null,null,null,null,{"$f":"IF(CITIZEN=AM100,\"P\",\"\")","v":{"$error":"#VALUE!"}},null,null,null,null,null,{"$f":"IF(CITIZEN=AK100,\"P\",\"\")","v":{"$error":"#VALUE!"}},"No",null,"Yes",null,null,null,null,"( Please tick as applicable)"]
[]
[null,null,{"$f":"IF(VLOOKUP($BK$6,DATABASE!$A:$BU,Workings!I102,0)=\"\",\"\",VLOOKUP($BK$6,DATABASE!$A:$BU,Workings!I102,0))","v":"adhar123"},null,null,null,null,null,58,null,null,null,null,"Please mention your AADHAAR number (if allotted)",null,null,null,null,null,null,null,null,null,null,null,null,null,null,null,null,null,{"$f":"UPPER(MID(Adhaar,1,1))","v":"A"},{"$f":"UPPER(MID(Adhaar,2,1))","v":"D"},{"$f":"UPPER(MID(Adhaar,3,1))","v":"H"},{"$f":"UPPER(MID(Adhaar,4,1))","v":"A"},{"$f":"UPPER(MID(Adhaar,5,1))","v":"R"},{"$f":"UPPER(MID(Adhaar,6,1))","v":"1"},{"$f":"UPPER(MID(Adhaar,7,1))","v":"2"},{"$f":"UPPER(MID(Adhaar,8,1))","v":"3"},{"$f":"UPPER(MID(Adhaar,9,1))","v":""},{"$f":"UPPER(MID(Adhaar,10,1))","v":""},{"$f":"UPPER(MID(Adhaar,11,1))","v":""},{"$f":"UPPER(MID(Adhaar,12,1))","v":""},{"$f":"UPPER(MID(Adhaar,13,1))","v":""},{"$f":"UPPER(MID(Adhaar,14,1))","v":""},{"$f":"UPPER(MID(Adhaar,15,1))","v":""},{"$f":"UPPER(MID(Adhaar,16,1))","v":""}]
[]
[null,null,null,null,null,null,null,null,null,null,null,null,13,"Source of Income ",null,null,null,null,null,null,null,null,null,null,null,null,null,null,null,null,null,null,null,null,null,null,null,null,null,null,null,null,"Please select status, ",null,null,null,null,null,"P","as applicable"]
[]
[null,null,{"$f":"IF(VLOOKUP($BK$6,DATABASE!$A:$BU,Workings!I106,0)=\"\",\"\",VLOOKUP($BK$6,DATABASE!$A:$BU,Workings!I106,0))","v":"Salary"},null,null,null,null,null,60,null,null,null,null,{"$f":"IF(SOI=O106,\"P\",\"\")","v":"P"},"Salary",null,null,null,null,null,null,null,null,null,null,null,null,null,null,null,null,null,null,null,null,null,null,null,null,null,null,null,{"$f":"IF(SOI=AS106,\"P\",\"\")","v":""},null,"Capital Gains"]
[]
[null,null,null,null,null,null,null,null,null,null,null,null,null,{"$f":"IF(SOI=O108,\"P\",\"\")","v":""},"Income from Business / Profession",null,null,null,null,null,null,null,null,null,"Business/Profession code",null,null,null,null,null,null,null,null,"Refer table at point no. 12",null,null,null,null,null,null,null,null,{"$f":"IF(SOI=AS108,\"P\",\"\")","v":""},null,"Income from Other sources"]
[]
[null,null,null,null,null,null,null,null,null,null,null,null,null,{"$f":"IF(SOI=O110,\"P\",\"\")","v":""},"Income from House property",null,null,null,null,null,null,null,null,null,null,null,null,null,null,null,null,null,null,null,null,null,null,null,null,null,null,null,{"$f":"IF(SOI=AS110,\"P\",\"\")","v":""},null,"No income"]
[]
[null,null,null,null,null,null,null,null,null,null,null,null,14,"Representative Assessee (RA)"]
[null,null,null,null,null,null,null,null,null,null,null,null,null,"Full name, address of the Representative Assessee, who is assessible under the Income Tax Act in respect of the person, whose particulars have been given in the "]
[null,null,null,null,null,null,null,null,null,null,null,null,null,"column 1 - 12."]
[]
[null,null,null,null,null,null,null,null,null,null,null,null,null,"Full Name (Full expanded name: initials are not permitted)"]
[null,null,null,null,null,null,null,null,null,null,null,null,null,"Please select title,",null,null,null,null,null,"P","as applicable",null,null,null,null,null,"Shri",null,null,null,"Smt.",null,null,null,"Kumari",null,null,null,"M/s"]
[]
[null,null,null,null,null,null,null,null,null,null,null,null,null,"Last Name / Surname"]
[]
[null,null,null,null,null,null,null,null,null,null,null,null,null,"First Name"]
[]
[null,null,null,null,null,null,null,null,null,null,null,null,null,"Middle Name"]
[]
[null,null,null,null,null,null,null,null,null,null,null,null,null,"RA's Address"]
[null,null,null,null,null,null,null,null,null,null,null,null,null,"Flat/Room/ Door / Block No."]
[]
[null,null,null,null,null,null,null,null,null,null,null,null,null,"Name of Premises/ Building/ Village"]
[]
[null,null,null,null,null,null,null,null,null,null,null,null,null,"Road/Street/ Lane/Post Office"]
[]
[null,null,null,null,null,null,null,null,null,null,null,null,null,"Area / Locality / Taluka/ Sub‐ Division"]
[]
[null,null,null,null,null,null,null,null,null,null,null,null,null,"Town / City / District"]
[null,null,null,null,null,null,null,null,null,null,null,null,null,"State / Union Territory",null,null,null,null,null,null,null,null,null,null,null,null,null,null,null,"Pincode / Zip code"]
[]
[]
[null,null,{"$f":"IF(VLOOKUP($BK$6,DATABASE!$A:$BU,Workings!I138,0)=\"\",\"\",VLOOKUP($BK$6,DATABASE!$A:$BU,Workings!I138,0))","v":"adhar"},null,null,null,null,null,61,null,null,null,15,"Documents submitted as Proof of Identity(POI) and Proof of Address (POA)"]
[]
[null,null,{"$f":"IF(VLOOKUP($BK$6,DATABASE!$A:$BU,Workings!I140,0)=\"\",\"\",VLOOKUP($BK$6,DATABASE!$A:$BU,Workings!I140,0))","v":"address"},null,null,null,null,null,62,null,null,null,null,"I/We have enclosed",null,null,null,null,null,null,{"$f":"UPPER(IDP)","v":"ADHAR"},null,null,null,null,null,null,null,null,null,null,null,"as proof of identity and",null,null,null,null,null,null,{"$f":"UPPER(ADP)","v":"ADDRESS"}]
[null,null,{"$f":"IF(VLOOKUP($BK$6,DATABASE!$A:$BU,Workings!I141,0)=\"\",\"\",VLOOKUP($BK$6,DATABASE!$A:$BU,Workings!I141,0))","v":"dob"},null,null,null,null,null,63,null,null,null,null,"as proof of address.",null,null,null,null,null,null,null,{"$f":"UPPER(DOBP)","v":"DOB"}]
[null,null,null,null,null,null,null,null,null,null,null,null,null,"[Please refer to the instructions (as specified in Rule 114 of I.T. Rules, 1962) for list of mandatory certified documents to be submitted as applicable]"]
[null,null,{"$f":"IF(VLOOKUP($BK$6,DATABASE!$A:$BU,Workings!I143,0)=\"\",\"\",VLOOKUP($BK$6,DATABASE!$A:$BU,Workings!I143,0))","v":"xyz"},null,null,null,null,null,64,null,null,null,16,"I",{"$f":"UPPER(NAMES)","v":"XYZ"},null,null,null,null,null,null,null,null,null,null,null,null,null,null,null,null,null,null,null,", the applicant, , in the capacity of",null,null,null,null,null,null,null,null,{"$f":"UPPER(CAPACITY)","v":"INDIVIDUAL"}]
[null,null,{"$f":"IF(VLOOKUP($BK$6,DATABASE!$A:$BU,Workings!I144,0)=\"\",\"\",VLOOKUP($BK$6,DATABASE!$A:$BU,Workings!I144,0))","v":"individual"},null,null,null,null,null,65,null,null,null,null,"do hereby declare that what is stated above is true to the best of my information and belief."]
[]
[null,null,{"$f":"IF(VLOOKUP($BK$6,DATABASE!$A:$BU,Workings!I146,0)=\"\",\"\",VLOOKUP($BK$6,DATABASE!$A:$BU,Workings!I146,0))","v":"bangalore"},null,null,null,null,null,66,null,null,null,null,null,"Place",null,null,null,null,null,{"$f":"UPPER(PLACE)","v":"BANGALORE"}]
[]
[null,null,null,null,null,null,null,null,null,null,null,null,null,null,null,null,null,null,null,null,"D","D","M","M","Y","Y","Y","Y",null,null,null,null,null,null,null,null,null,null,null,null,"Signature / Left Thumb Impression of \nApplicant (inside the box)"]
[null,null,{"$f":"DATE(IF(VLOOKUP($BK$6,DATABASE!$A:$BU,69,0)=\"\",\"\",VLOOKUP($BK$6,DATABASE!$A:$BU,69,0)),IF(VLOOKUP($BK$6,DATABASE!$A:$BU,68,0)=\"\",\"\",VLOOKUP($BK$6,DATABASE!$A:$BU,68,0)),IF(VLOOKUP($BK$6,DATABASE!$A:$BU,Workings!I149,0)=\"\",\"\",VLOOKUP($BK$6,DATABASE!$A:$BU,Workings!I149,0)))","v":"2017-03-12"},null,null,null,null,null,67,null,null,null,null,null,"Date",null,null,null,null,null,{"$f":"IFERROR(MID(TEXT(DAY(A6_),\"dd\"),1,1),\"\")","v":"1"},{"$f":"IFERROR(MID(TEXT(DAY(A6_),\"dd\"),2,1),\"\")","v":"2"},{"$f":"IFERROR(MID(TEXT(MONTH(A6_),\"dd\"),1,1),\"\")","v":"0"},{"$f":"IFERROR(MID(TEXT(MONTH(A6_),\"dd\"),2,1),\"\")","v":"3"},{"$f":"IFERROR(MID((YEAR(A6_)),1,1),\"\")","v":"2"},{"$f":"IFERROR(MID((YEAR(A6_)),2,1),\"\")","v":"0"},{"$f":"IFERROR(MID((YEAR(A6_)),3,1),\"\")","v":"1"},{"$f":"IFERROR(MID((YEAR(A6_)),4,1),\"\")","v":"7"}]