{"text_format":"1","workbook":"xlsx","n_sheets":6,"sheets":["Home","Form entry","Sheet1","Form 49A","DATABASE","Workings"],"not_rendered":{"charts":0,"images":65,"macros":1,"external_links":1,"defined_names":81,"comments":0,"pivot_tables":0},"unopened":[],"bounds":{"document_bytes":16777216,"sheet_cells":100000,"rows_first":2000,"rows_last":500,"rows_between":2000,"halvings":0,"cell_chars":16384,"cell_head_chars":4096},"cells_cut":0,"cells_raw":0,"read":"whole","date_system":"1900"}

{"sheet":"Home","index":0,"n_rows":504,"n_cols":7,"rows_kept":504,"cut":false,"hidden":false,"merged":[[0,4,0,5],[2,4,2,5]]}
[null,null,null,null,{"$f":"Workings!BK14","v":"Not Registered"}]
[]
[null,null,null,null,"Activation Code:"]
["Sl No","First Name","Middle Name","Last Name","Acknowledgment No.","PAN","Remark"]
[1,{"$f":"IFERROR((VLOOKUP($A5,DATABASE!$A:$BU,15,0)),\"\")","v":"XYX"},{"$f":"IFERROR((VLOOKUP($A5,DATABASE!$A:$BU,16,0)),\"\")","v":"ABC"},{"$f":"IFERROR((VLOOKUP($A5,DATABASE!$A:$BU,17,0)),\"\")","v":"HHH"},12345]
[2,{"$f":"IFERROR((VLOOKUP($A6,DATABASE!$A:$BU,15,0)),\"\")","v":"xyz"},{"$f":"IFERROR((VLOOKUP($A6,DATABASE!$A:$BU,16,0)),\"\")","v":"abc"},{"$f":"IFERROR((VLOOKUP($A6,DATABASE!$A:$BU,17,0)),\"\")","v":"pqr"}]
[3,{"$f":"IFERROR((VLOOKUP($A7,DATABASE!$A:$BU,15,0)),\"\")","v":0},{"$f":"IFERROR((VLOOKUP($A7,DATABASE!$A:$BU,16,0)),\"\")","v":0},{"$f":"IFERROR((VLOOKUP($A7,DATABASE!$A:$BU,17,0)),\"\")","v":0}]
[4,{"$f":"IFERROR((VLOOKUP($A8,DATABASE!$A:$BU,15,0)),\"\")","v":0},{"$f":"IFERROR((VLOOKUP($A8,DATABASE!$A:$BU,16,0)),\"\")","v":0},{"$f":"IFERROR((VLOOKUP($A8,DATABASE!$A:$BU,17,0)),\"\")","v":0}]
[5,{"$f":"IFERROR((VLOOKUP($A9,DATABASE!$A:$BU,15,0)),\"\")","v":0},{"$f":"IFERROR((VLOOKUP($A9,DATABASE!$A:$BU,16,0)),\"\")","v":0},{"$f":"IFERROR((VLOOKUP($A9,DATABASE!$A:$BU,17,0)),\"\")","v":0}]
[6,{"$f":"IFERROR((VLOOKUP($A10,DATABASE!$A:$BU,15,0)),\"\")","v":0},{"$f":"IFERROR((VLOOKUP($A10,DATABASE!$A:$BU,16,0)),\"\")","v":0},{"$f":"IFERROR((VLOOKUP($A10,DATABASE!$A:$BU,17,0)),\"\")","v":0}]
[7,{"$f":"IFERROR((VLOOKUP($A11,DATABASE!$A:$BU,15,0)),\"\")","v":0},{"$f":"IFERROR((VLOOKUP($A11,DATABASE!$A:$BU,16,0)),\"\")","v":0},{"$f":"IFERROR((VLOOKUP($A11,DATABASE!$A:$BU,17,0)),\"\")","v":0}]
[8,{"$f":"IFERROR((VLOOKUP($A12,DATABASE!$A:$BU,15,0)),\"\")","v":0},{"$f":"IFERROR((VLOOKUP($A12,DATABASE!$A:$BU,16,0)),\"\")","v":0},{"$f":"IFERROR((VLOOKUP($A12,DATABASE!$A:$BU,17,0)),\"\")","v":0}]
[9,{"$f":"IFERROR((VLOOKUP($A13,DATABASE!$A:$BU,15,0)),\"\")","v":0},{"$f":"IFERROR((VLOOKUP($A13,DATABASE!$A:$BU,16,0)),\"\")","v":0},{"$f":"IFERROR((VLOOKUP($A13,DATABASE!$A:$BU,17,0)),\"\")","v":0}]
[10,{"$f":"IFERROR((VLOOKUP($A14,DATABASE!$A:$BU,15,0)),\"\")","v":0},{"$f":"IFERROR((VLOOKUP($A14,DATABASE!$A:$BU,16,0)),\"\")","v":0},{"$f":"IFERROR((VLOOKUP($A14,DATABASE!$A:$BU,17,0)),\"\")","v":0}]
[11,{"$f":"IFERROR((VLOOKUP($A15,DATABASE!$A:$BU,15,0)),\"\")","v":0},{"$f":"IFERROR((VLOOKUP($A15,DATABASE!$A:$BU,16,0)),\"\")","v":0},{"$f":"IFERROR((VLOOKUP($A15,DATABASE!$A:$BU,17,0)),\"\")","v":0}]
[12,{"$f":"IFERROR((VLOOKUP($A16,DATABASE!$A:$BU,15,0)),\"\")","v":0},{"$f":"IFERROR((VLOOKUP($A16,DATABASE!$A:$BU,16,0)),\"\")","v":0},{"$f":"IFERROR((VLOOKUP($A16,DATABASE!$A:$BU,17,0)),\"\")","v":0}]
[13,{"$f":"IFERROR((VLOOKUP($A17,DATABASE!$A:$BU,15,0)),\"\")","v":0},{"$f":"IFERROR((VLOOKUP($A17,DATABASE!$A:$BU,16,0)),\"\")","v":0},{"$f":"IFERROR((VLOOKUP($A17,DATABASE!$A:$BU,17,0)),\"\")","v":0}]
[14,{"$f":"IFERROR((VLOOKUP($A18,DATABASE!$A:$BU,15,0)),\"\")","v":0},{"$f":"IFERROR((VLOOKUP($A18,DATABASE!$A:$BU,16,0)),\"\")","v":0},{"$f":"IFERROR((VLOOKUP($A18,DATABASE!$A:$BU,17,0)),\"\")","v":0}]
[15,{"$f":"IFERROR((VLOOKUP($A19,DATABASE!$A:$BU,15,0)),\"\")","v":0},{"$f":"IFERROR((VLOOKUP($A19,DATABASE!$A:$BU,16,0)),\"\")","v":0},{"$f":"IFERROR((VLOOKUP($A19,DATABASE!$A:$BU,17,0)),\"\")","v":0}]
[16,{"$f":"IFERROR((VLOOKUP($A20,DATABASE!$A:$BU,15,0)),\"\")","v":0},{"$f":"IFERROR((VLOOKUP($A20,DATABASE!$A:$BU,16,0)),\"\")","v":0},{"$f":"IFERROR((VLOOKUP($A20,DATABASE!$A:$BU,17,0)),\"\")","v":0}]
{"$rows_left_out":485}
{"sheet":"Form entry","index":1,"n_rows":73,"n_cols":35,"rows_kept":73,"cut":false,"hidden":true,"merged":[[72,1,72,2],[72,5,72,6],[68,1,68,6],[68,7,68,12],[68,13,68,18],[69,1,69,6],[69,7,69,12],[69,13,69,18],[61,7,61,15],[64,1,64,6],[64,7,64,12],[64,13,64,18],[65,1,65,6],[65,7,65,12],[65,13,65,18],[52,5,52,7],[52,8,52,15],[53,3,53,15],[55,7,55,15],[59,13,59,21],[57,13,57,21],[24,7,24,12],[24,13,24,18],[27,1,27,9],[27,10,27,18],[48,10,48,14],[37,1,37,9],[37,10,37,18],[28,10,28,18],[29,10,29,18],[30,10,30,18],[31,10,31,18],[32,10,32,18],[33,10,33,18],[34,10,34,18],[35,10,35,18],[24,1,24,6],[20,1,20,5],[20,13,20,14],[23,1,23,6],[23,7,23,12],[23,13,23,18],[17,1,17,2],[17,3,17,8],[17,9,17,14],[17,15,17,20],[12,1,12,20],[13,1,13,20],[15,12,15,13],[16,1,16,2],[16,3,16,8],[16,9,16,14],[16,15,16,20],[8,3,8,8],[8,9,8,14],[8,15,8,20],[8,1,8,2],[9,1,9,2],[9,3,9,8],[9,9,9,14],[9,15,9,20],[3,1,3,3],[3,4,3,5],[3,6,3,8],[3,9,3,10],[0,0,0,13],[44,10,44,18],[45,10,45,18],[46,10,46,18],[38,10,38,18],[71,1,71,2],[71,3,71,6],[39,10,39,18],[40,10,40,18],[41,10,41,18],[42,10,42,18],[43,10,43,18],[51,1,51,4],[51,5,51,7],[51,8,51,15],[53,1,53,2],[52,1,52,4]]}
["Data for PAN application 49A",null,null,null,null,null,null,null,null,null,null,null,null,null,null,null,null,null,null,null,null,null,null,null,null,null,null,null,2,null,"EDIT",null,null,null,2]
[]
[null,"Assessing officer (AO code)"]
[null,"Area code",null,null,"AO type",null,"Range Code",null,null,"AO No."]
[]
[]
[null,"1. Full Name "]
[null,"(Full expanded name to be mentioned as appearing in proof of identity/address documents: initials are not permitted)"]
[null,"Title",null,"First Name",null,null,null,null,null,"Middle Name",null,null,null,null,null,"Last Name / Surname"]
[null,"Shri",null,"xyz",null,null,null,null,null,"abc",null,null,null,null,null,"pqr"]
[]
[null,"2. Abbreviation of the above name, as you would like it, to be printed on the PAN card"]
[]
[]
[]
[null,"3. Have you ever been known by any other name?"]
[null,"Title",null,"First Name",null,null,null,null,null,"Middle Name",null,null,null,null,null,"Last Name / Surname"]
[]
[]
[null,"4. Sex (for Individual applicants only)",null,null,null,null,null,null,null,null,null,"5. Date of Birth/Incorporation (DD-MM-YYYY)"]
{"$rows_left_out":54}
{"sheet":"Sheet1","index":2,"n_rows":66,"n_cols":10,"rows_kept":66,"cut":false,"hidden":true,"merged":[]}
[]
[]
[]
[null,"Sheets(\"Form entry\").Range(\"","B5","\")"," = ","Sheets(\"DATABASE\").Cells(","rowno,",2,")",{"$f":"CONCATENATE(F4,G4,H4,I4,E4,B4,C4,D4)","v":"Sheets(\"DATABASE\").Cells(rowno,2) = Sheets(\"Form entry\").Range(\"B5\")"}]
[null,"Sheets(\"Form entry\").Range(\"","C5","\")"," = ","Sheets(\"DATABASE\").Cells(","rowno,",3,")",{"$f":"CONCATENATE(F5,G5,H5,I5,E5,B5,C5,D5)","v":"Sheets(\"DATABASE\").Cells(rowno,3) = Sheets(\"Form entry\").Range(\"C5\")"}]
[null,"Sheets(\"Form entry\").Range(\"","D5","\")"," = ","Sheets(\"DATABASE\").Cells(","rowno,",4,")","Sheets(\"DATABASE\").Cells(rowno,4) = Sheets(\"Form entry\").Range(\"D5\")"]
[null,"Sheets(\"Form entry\").Range(\"","E5","\")"," = ","Sheets(\"DATABASE\").Cells(","rowno,",5,")","Sheets(\"DATABASE\").Cells(rowno,5) = Sheets(\"Form entry\").Range(\"E5\")"]
[null,"Sheets(\"Form entry\").Range(\"","F5","\")"," = ","Sheets(\"DATABASE\").Cells(","rowno,",6,")","Sheets(\"DATABASE\").Cells(rowno,6) = Sheets(\"Form entry\").Range(\"F5\")"]
[null,"Sheets(\"Form entry\").Range(\"","G5","\")"," = ","Sheets(\"DATABASE\").Cells(","rowno,",7,")","Sheets(\"DATABASE\").Cells(rowno,7) = Sheets(\"Form entry\").Range(\"G5\")"]
[null,"Sheets(\"Form entry\").Range(\"","H5","\")"," = ","Sheets(\"DATABASE\").Cells(","rowno,",8,")","Sheets(\"DATABASE\").Cells(rowno,8) = Sheets(\"Form entry\").Range(\"H5\")"]
[null,"Sheets(\"Form entry\").Range(\"","I5","\")"," = ","Sheets(\"DATABASE\").Cells(","rowno,",9,")","Sheets(\"DATABASE\").Cells(rowno,9) = Sheets(\"Form entry\").Range(\"I5\")"]
[null,"Sheets(\"Form entry\").Range(\"","J5","\")"," = ","Sheets(\"DATABASE\").Cells(","rowno,",10,")","Sheets(\"DATABASE\").Cells(rowno,10) = Sheets(\"Form entry\").Range(\"J5\")"]
[null,"Sheets(\"Form entry\").Range(\"","K5","\")"," = ","Sheets(\"DATABASE\").Cells(","rowno,",11,")","Sheets(\"DATABASE\").Cells(rowno,11) = Sheets(\"Form entry\").Range(\"K5\")"]
[null,"Sheets(\"Form entry\").Range(\"","B10","\")"," = ","Sheets(\"DATABASE\").Cells(","rowno,",14,")","Sheets(\"DATABASE\").Cells(rowno,14) = Sheets(\"Form entry\").Range(\"B10\")"]
[null,"Sheets(\"Form entry\").Range(\"","D10","\")"," = ","Sheets(\"DATABASE\").Cells(","rowno,",15,")","Sheets(\"DATABASE\").Cells(rowno,15) = Sheets(\"Form entry\").Range(\"D10\")"]
[null,"Sheets(\"Form entry\").Range(\"","J10","\")"," = ","Sheets(\"DATABASE\").Cells(","rowno,",16,")","Sheets(\"DATABASE\").Cells(rowno,16) = Sheets(\"Form entry\").Range(\"J10\")"]
[null,"Sheets(\"Form entry\").Range(\"","P10","\")"," = ","Sheets(\"DATABASE\").Cells(","rowno,",17,")","Sheets(\"DATABASE\").Cells(rowno,17) = Sheets(\"Form entry\").Range(\"P10\")"]
[null,"Sheets(\"Form entry\").Range(\"","B13","\")"," = ","Sheets(\"DATABASE\").Cells(","rowno,",18,")","Sheets(\"DATABASE\").Cells(rowno,18) = Sheets(\"Form entry\").Range(\"B13\")"]
[null,"Sheets(\"Form entry\").Range(\"","B14","\")"," = ","Sheets(\"DATABASE\").Cells(","rowno,",19,")","Sheets(\"DATABASE\").Cells(rowno,19) = Sheets(\"Form entry\").Range(\"B14\")"]
[null,"Sheets(\"Form entry\").Range(\"","M16","\")"," = ","Sheets(\"DATABASE\").Cells(","rowno,",20,")","Sheets(\"DATABASE\").Cells(rowno,20) = Sheets(\"Form entry\").Range(\"M16\")"]
{"$rows_left_out":47}
{"sheet":"Form 49A","index":3,"n_rows":0,"n_cols":0,"rows_kept":0,"cut":false,"hidden":true,"merged":[]}

{"sheet":"DATABASE","index":4,"n_rows":501,"n_cols":73,"rows_kept":501,"cut":false,"hidden":true,"merged":[[0,63,0,69],[0,19,0,24],[0,29,0,32],[0,33,0,49],[0,51,0,54],[0,57,0,58],[0,60,0,62],[0,26,0,28],[0,17,0,18],[0,1,0,3],[0,4,0,5],[0,6,0,8],[0,9,0,12],[0,13,0,16]]}
["Sl No","Area code",null,null,"AO type",null,"Range Code",null,null,"AO No.",null,null,null,"Point No. 1",null,null,null,"Point No. 2",null,"Point No. 3",null,null,null,null,null,"Point No. 4","Point No. 5",null,null,"Point No. 6",null,null,null,"Point No. 7",null,null,null,null,null,null,null,null,null,null,null,null,null,null,null,null,"Point No. 8","Point No. 9",null,null,null,"Point No. 10","Point No. 11","Point No. 12",null,"Point No. 13","Point No. 15",null,null,"Point No. 16",null,null,null,null,null,null,"Acknowledgment No.","Remark","PAN"]
[1,null,null,null,null,null,null,null,null,null,null,null,null,"Shri","XYX","ABC","HHH","XYZ ABC",null,"Yes","Shri","SSSS",null,"G",null,"Male",20,1,"1905-06-10","ADFASDC","DFASDCF","FFFFF",null,"no. 4, ","5th cross","gayatri tapovana","kottanuru dinne","j p nagar ","karnataka",560078,"india","new office","no. 4, ","5th cross","gayatri tapovana","kottanuru dinne","j p nagar ","karnataka",560078,"india","Residence","91","080","123456789","xyz@abc.com","Individual","regno:123","adhar123",null,"Salary","adhar","address","dob","xyz","individual","bangalore",12,3,2017]
[2,null,null,null,null,null,null,null,null,null,null,null,null,"Shri","xyz","abc","pqr",null,null,null,null,null,null,null,null,null,null,null,null,null,null,null,null,null,null,null,null,null,null,null,null,null,null,null,null,null,null,null,null,null,"Residence",null,null,null,null,"Individual",null,null,null,"Capital Gains"]
[3]
[4]
[5]
[6]
[7]
[8]
[9]
[10]
[11]
[12]
[13]
[14]
[15]
[16]
[17]
[18]
[19]
{"$rows_left_out":482}
{"sheet":"Workings","index":5,"n_rows":149,"n_cols":63,"rows_kept":149,"cut":false,"hidden":true,"merged":[[7,42,7,43],[7,38,7,39],[7,36,7,37],[6,36,6,39],[145,20,145,27],[78,36,78,49],[6,20,6,25],[6,26,6,29],[6,30,6,35],[7,40,7,41],[140,21,140,33],[142,14,142,28],[41,17,41,18],[41,20,41,23],[64,13,64,28],[64,36,64,49],[147,40,148,50],[7,20,7,21],[7,22,7,23],[7,24,7,25],[7,26,7,27],[7,28,7,29],[7,30,7,31],[7,32,7,33],[7,34,7,35],[86,18,86,44],[135,13,135,28],[139,20,139,31],[139,39,139,50],[142,43,142,50],[78,13,78,28],[41,14,41,15],[0,19,0,47],[1,19,1,47],[2,19,2,47],[3,19,3,47],[4,11,4,54]]}
[null,null,null,null,null,null,null,null,null,null,null,null,null,null,null,null,null,null,null,"Form No. 49A"]
[null,null,null,null,null,null,null,null,null,null,null,null,null,null,null,null,null,null,null,"Application for Allotment of Permanent Account Number"]
[null,null,null,null,null,null,null,null,null,null,null,null,null,null,null,null,null,null,null,"Under section 139A of the Income Tax act, 1961"]
[null,null,null,null,null,null,null,null,null,null,null,null,null,null,null,null,null,null,null,"To avoid mistake (s), please follow the accompanying instructions and examples before filling up the form",null,null,null,null,null,null,null,null,null,null,null,null,null,null,null,null,null,null,null,null,null,null,null,null,null,null,null,null,null,null,null,null,null,null,null,null,null,null,null,null,null,"Sl No for New form",7]
[null,null,2,{"$f":"+C5+1","v":3},{"$f":"+D5+1","v":4},5,6,7,null,null,null,null,null,null,null,null,null,null,null,null,null,null,null,null,null,null,null,null,null,null,null,null,null,null,null,null,null,null,null,null,null,null,null,null,null,null,null,null,null,null,null,null,null,null,null,null,null,null,null,null,null,"row no for form edit & update",12345]
[null,null,{"$f":"+H5+1","v":8},{"$f":"+C6+1","v":9},10,11,12,13,null,null,null,null,null,null,null,null,null,null,null,null,"Assessing officer (AO code)",null,null,null,null,null,null,null,null,null,null,null,null,null,null,null,null,null,null,null,null,null,null,null,null,null,null,null,null,null,null,null,null,null,null,null,null,null,null,null,null,"vlookup no for print",1]
[null,null,{"$f":"IF(VLOOKUP($BK$6,DATABASE!$A:$BU,Workings!C5,0)=\"\",\"\",VLOOKUP($BK$6,DATABASE!$A:$BU,Workings!C5,0))","v":""},{"$f":"IF(VLOOKUP($BK$6,DATABASE!$A:$BU,Workings!D5,0)=\"\",\"\",VLOOKUP($BK$6,DATABASE!$A:$BU,Workings!D5,0))","v":""},{"$f":"IF(VLOOKUP($BK$6,DATABASE!$A:$BU,Workings!E5,0)=\"\",\"\",VLOOKUP($BK$6,DATABASE!$A:$BU,Workings!E5,0))","v":""},{"$f":"IF(VLOOKUP($BK$6,DATABASE!$A:$BU,Workings!F5,0)=\"\",\"\",VLOOKUP($BK$6,DATABASE!$A:$BU,Workings!F5,0))","v":""},{"$f":"IF(VLOOKUP($BK$6,DATABASE!$A:$BU,Workings!G5,0)=\"\",\"\",VLOOKUP($BK$6,DATABASE!$A:$BU,Workings!G5,0))","v":""},{"$f":"IF(VLOOKUP($BK$6,DATABASE!$A:$BU,Workings!H5,0)=\"\",\"\",VLOOKUP($BK$6,DATABASE!$A:$BU,Workings!H5,0))","v":""},null,null,null,null,null,null,null,null,null,null,null,null,"Area code",null,null,null,null,null,"AO type",null,null,null,"Range code",null,null,null,null,null,"AO No."]
[null,null,{"$f":"IF(VLOOKUP($BK$6,DATABASE!$A:$BU,Workings!C6,0)=\"\",\"\",VLOOKUP($BK$6,DATABASE!$A:$BU,Workings!C6,0))","v":""},{"$f":"IF(VLOOKUP($BK$6,DATABASE!$A:$BU,Workings!D6,0)=\"\",\"\",VLOOKUP($BK$6,DATABASE!$A:$BU,Workings!D6,0))","v":""},{"$f":"IF(VLOOKUP($BK$6,DATABASE!$A:$BU,Workings!E6,0)=\"\",\"\",VLOOKUP($BK$6,DATABASE!$A:$BU,Workings!E6,0))","v":""},{"$f":"IF(VLOOKUP($BK$6,DATABASE!$A:$BU,Workings!F6,0)=\"\",\"\",VLOOKUP($BK$6,DATABASE!$A:$BU,Workings!F6,0))","v":""},null,null,null,null,null,null,null,null,null,null,null,null,null,null,{"$f":"IF(C7=\"\",\"\",C7)","v":""},null,{"$f":"D7","v":""},null,{"$f":"+E7","v":""},null,{"$f":"+F7","v":""},null,{"$f":"+G7","v":""},null,{"$f":"+H7","v":""},null,{"$f":"+C8","v":""},null,{"$f":"+D8","v":""},null,{"$f":"+E8","v":""},null,{"$f":"+F8","v":""}]
[]
[null,null,null,null,null,null,null,null,null,null,null,null,null,"Sir,",null,null,null,null,null,null,null,null,null,null,null,null,null,null,null,null,null,null,null,null,null,null,null,null,null,null,null,null,null,null,null,null,null,null,null,null,null,null,null,null,null,null,null,null,null,null,null,"Reg Code 1","ATSD-1RI5-1T4Z-123"]
[null,null,null,null,null,null,null,null,null,null,null,null,null,"I/We hereby request that a permanent account number be allotted to me/us.",null,null,null,null,null,null,null,null,null,null,null,null,null,null,null,null,null,null,null,null,null,null,null,null,null,null,null,null,null,null,null,null,null,null,null,null,null,null,null,null,null,null,null,null,null,null,null,"Reg Code 2",{"$f":"Home!G3","v":0}]
[null,null,null,null,null,null,null,null,null,null,null,null,null,"I/We give below necessary particulars:"]
[]
[null,null,null,null,null,null,null,null,null,null,null,null,1,"Full Name (Full expanded name to be mentioned as appearing in proof of identity/address documents: initials are not permitted)",null,null,null,null,null,null,null,null,null,null,null,null,null,null,null,null,null,null,null,null,null,null,null,null,null,null,null,null,null,null,null,null,null,null,null,null,null,null,null,null,null,null,null,null,null,null,null,null,{"$f":"IF(BK10=BK11,\"Registered\",\"Not Registered\")","v":"Not Registered"}]
[null,null,{"$f":"IF(VLOOKUP($BK$6,DATABASE!$A:$BU,Workings!I15,0)=\"\",\"\",VLOOKUP($BK$6,DATABASE!$A:$BU,Workings!I15,0))","v":"Shri"},null,null,null,null,null,14,null,null,null,null,"Please select title,",null,null,null,null,null,"P","as applicable",null,null,null,null,{"$f":"IF(SHR=AT15,\"P\",\"\")","v":"P"},null,null,null,{"$f":"IF(SHR=AU15,\"P\",\"\")","v":""},null,null,null,{"$f":"IF(SHR=AV15,\"P\",\"\")","v":""},null,null,null,{"$f":"IF(SHR=AM15,\"P\",\"\")","v":""},"M/s",null,null,null,null,null,null,"Shri","Smt.","Kumari"]
[]
[null,null,{"$f":"IF(VLOOKUP($BK$6,DATABASE!$A:$BU,Workings!I17,0)=\"\",\"\",VLOOKUP($BK$6,DATABASE!$A:$BU,Workings!I17,0))","v":"HHH"},null,null,null,null,null,17,null,null,null,null,"Last Name / Surname",null,null,null,null,null,null,{"$f":"UPPER(MID(Name_3,1,1))","v":"H"},{"$f":"UPPER(MID(Name_3,2,1))","v":"H"},{"$f":"UPPER(MID(Name_3,3,1))","v":"H"},{"$f":"UPPER(MID(Name_3,4,1))","v":""},{"$f":"UPPER(MID(Name_3,5,1))","v":""},{"$f":"UPPER(MID(Name_3,6,1))","v":""},{"$f":"UPPER(MID(Name_3,7,1))","v":""},{"$f":"UPPER(MID(Name_3,8,1))","v":""},{"$f":"UPPER(MID(Name_3,9,1))","v":""},{"$f":"UPPER(MID(Name_3,10,1))","v":""},{"$f":"UPPER(MID(Name_3,11,1))","v":""},{"$f":"UPPER(MID(Name_3,12,1))","v":""},{"$f":"UPPER(MID(Name_3,13,1))","v":""},{"$f":"UPPER(MID(Name_3,14,1))","v":""},{"$f":"UPPER(MID(Name_3,15,1))","v":""},{"$f":"UPPER(MID(Name_3,16,1))","v":""},{"$f":"UPPER(MID(Name_3,17,1))","v":""},{"$f":"UPPER(MID(Name_3,18,1))","v":""},{"$f":"UPPER(MID(Name_3,19,1))","v":""},{"$f":"UPPER(MID(Name_3,20,1))","v":""},{"$f":"UPPER(MID(Name_3,21,1))","v":""},{"$f":"UPPER(MID(Name_3,22,1))","v":""},{"$f":"UPPER(MID(Name_3,23,1))","v":""},{"$f":"UPPER(MID(Name_3,24,1))","v":""},{"$f":"UPPER(MID(Name_3,25,1))","v":""}]
[]
[null,null,{"$f":"IF(VLOOKUP($BK$6,DATABASE!$A:$BU,Workings!I19,0)=\"\",\"\",VLOOKUP($BK$6,DATABASE!$A:$BU,Workings!I19,0))","v":"XYX"},null,null,null,null,null,15,null,null,null,null,"First Name",null,null,null,null,null,null,{"$f":"UPPER(MID(Name_1,1,1))","v":"X"},{"$f":"UPPER(MID(Name_1,2,1))","v":"Y"},{"$f":"UPPER(MID(Name_1,3,1))","v":"X"},{"$f":"UPPER(MID(Name_1,4,1))","v":""},{"$f":"UPPER(MID(Name_1,5,1))","v":""},{"$f":"UPPER(MID(Name_1,6,1))","v":""},{"$f":"UPPER(MID(Name_1,7,1))","v":""},{"$f":"UPPER(MID(Name_1,8,1))","v":""},{"$f":"UPPER(MID(Name_1,9,1))","v":""},{"$f":"UPPER(MID(Name_1,10,1))","v":""},{"$f":"UPPER(MID(Name_1,11,1))","v":""},{"$f":"UPPER(MID(Name_1,12,1))","v":""},{"$f":"UPPER(MID(Name_1,13,1))","v":""},{"$f":"UPPER(MID(Name_1,14,1))","v":""},{"$f":"UPPER(MID(Name_1,15,1))","v":""},{"$f":"UPPER(MID(Name_1,16,1))","v":""},{"$f":"UPPER(MID(Name_1,17,1))","v":""},{"$f":"UPPER(MID(Name_1,18,1))","v":""},{"$f":"UPPER(MID(Name_1,19,1))","v":""},{"$f":"UPPER(MID(Name_1,20,1))","v":""},{"$f":"UPPER(MID(Name_1,21,1))","v":""},{"$f":"UPPER(MID(Name_1,22,1))","v":""},{"$f":"UPPER(MID(Name_1,23,1))","v":""},{"$f":"UPPER(MID(Name_1,24,1))","v":""},{"$f":"UPPER(MID(Name_1,25,1))","v":""}]
[]
{"$rows_left_out":129}